{"text_format":"1","workbook":"xlsx","n_sheets":5,"sheets":["Allg_Angaben","Auswertung","Log","Tabelle1","Tabelle2"],"not_rendered":{"charts":0,"images":0,"macros":1,"external_links":0,"defined_names":15,"comments":1,"pivot_tables":0},"unopened":[],"bounds":{"document_bytes":16777216,"sheet_cells":100000,"rows_first":2000,"rows_last":500,"rows_between":2000,"halvings":0,"cell_chars":16384,"cell_head_chars":4096},"cells_cut":0,"cells_raw":0,"read":"whole","date_system":"1900"}

{"sheet":"Allg_Angaben","index":0,"n_rows":35,"n_cols":7,"rows_kept":35,"cut":false,"hidden":false,"merged":[]}
["VFDB-DLPX-Contest 2025"]
["Version 3 vom 12.12.2021",null,null,null,null,"Contest-Datum : ","2025-01-19"]
["Angaben zum Contest :"]
[]
[null,null,null,"Band : ","80m ","Mode : ","CW"]
[]
[]
[null,null," ",null," "]
[]
["Angaben zum Tln :"]
[]
[null,"Rufzeichen : ",null,null,"Op-Call bei Clubstn:"]
[]
[null,"DOK : ",null,{"$f":"IF(LEFT(dok,1)=\"Z\",\"Z\",\"\")","v":""}]
[]
["Anschrift :",null,"Name : "]
[null,null,"Strasse : "]
[null,null,"PLZ/Ort : "]
[null,null,"(falls vorhanden) E-Mail-Adresse : "]
["Station :",null,"Sender/Ausgangsleistung : "]
[null,null,"Empfänger/Eingangsstufe :"," "]
[null,null,"Antenne/ über NN :"]
[]
["Beteiligte Funkamateure bei Mehrmannbetrieb :"]
[null,"Rufzeichen","Name"," ","DOK"]
[]
[]
[]
[]
[]
["Auswertung des Contestes "]
[null,null,null,null,"Anzahl der QSOs :",{"$f":"COUNTIF(Log!P:P,1)","v":0}]
[null,null,null,null,"Anzahl der QSO-Punkte :",{"$f":"punkt1","v":0}]
["Band : ",{"$f":"band1","v":"80m "},null,null,"Anzahl der Multiplikatoren :",{"$f":"multi1","v":0}]
["Mode : ",{"$f":"mode1","v":"CW"},null,null,"Gesamtpunktzahl :",{"$f":"gesamt1","v":0}]

{"sheet":"Auswertung","index":1,"n_rows":30,"n_cols":46,"rows_kept":30,"cut":false,"hidden":false,"merged":[[3,45,3,46],[36,1,36,24],[27,0,27,1],[3,49,3,50],[31,1,31,24],[33,6,33,8],[33,23,33,24],[27,21,27,22],[27,18,27,19],[33,17,33,19],[27,5,27,11],[27,12,27,13],[39,18,39,19],[35,1,35,24],[30,12,30,13],[34,12,34,13],[33,3,33,5],[32,1,32,24],[33,20,33,22],[33,9,33,11]]}
[]
[]
["Auswertung des Contestes"]
[null,null,null,null,null,null,null,null,null,null,null,null,null,null,null,null,null,null,null,null,null,null,null,null,"Summe der QSO-Punkte :",{"$f":"SUM(Log!L:L)","v":0}]
[]
[null,null,null,null,"Band : ",{"$f":"band1","v":"80m "},null,null,null,"Mode : ",null,{"$f":"mode1","v":"CW"},null,null,null,null,null,null,null,null,null,null,null,null,"Summe der Multiplikatoren :",{"$f":"SUM(Log!M:M)","v":0}]
[null,null,null,null,null,null,null,null,null,null,null,null,null,null,null,null,null,null,null,null,null,null,null,null,"Gesamtpunktzahl Multi x QSO-Pkte :",{"$f":"(multi1+Z3)*punkt1","v":0}]
[]
[]
[]
[]
[]
["Liste der Multiplikatoren "]
[]
["DL-Präfixe / VFDB-Sonderstationen",null,null,null,null,null,null,null,null,null,null,null,null,null,null,null,null,null,null,null,null,null,null,null,null,null,null,null,null,null,"DL-Präfixe"]
[null,null,null,null,null,null,null,null,null,null,null,null,null,null,null,null,null,null,null,null,null,null,null,null,null,null,null,null,"VFDB-SStn"]
[null,"DA","DB","DC","DD","DF","DG","DH","DJ","DK","DL","DM","DN","DO","DP","DQ","DR","VFDB-Sonder-Stn.",null,null,null,null,null,null,null,null,null,null,"DB0DBP",null,"DA0","DB0","DC0","DD0","DF0","DG0","DH0","DJ0","DK0","DL0","DM0","DN0","DO0","DP0","DQ0","DR0"]
[0,{"$f":"IF(COUNTIF(Log!X:X,AE17)>0,\"X\",\"\")","v":""},{"$f":"IF(COUNTIF(Log!X:X,AF17)>0,\"X\",\"\")","v":""},{"$f":"IF(COUNTIF(Log!X:X,AG17)>0,\"X\",\"\")","v":""},{"$f":"IF(COUNTIF(Log!X:X,AH17)>0,\"X\",\"\")","v":""},{"$f":"IF(COUNTIF(Log!X:X,AI17)>0,\"X\",\"\")","v":""},{"$f":"IF(COUNTIF(Log!X:X,AJ17)>0,\"X\",\"\")","v":""},{"$f":"IF(COUNTIF(Log!X:X,AK17)>0,\"X\",\"\")","v":""},{"$f":"IF(COUNTIF(Log!X:X,AL17)>0,\"X\",\"\")","v":""},{"$f":"IF(COUNTIF(Log!X:X,AM17)>0,\"X\",\"\")","v":""},{"$f":"IF(COUNTIF(Log!X:X,AN17)>0,\"X\",\"\")","v":""},{"$f":"IF(COUNTIF(Log!X:X,AO17)>0,\"X\",\"\")","v":""},{"$f":"IF(COUNTIF(Log!X:X,AP17)>0,\"X\",\"\")","v":""},{"$f":"IF(COUNTIF(Log!X:X,AQ17)>0,\"X\",\"\")","v":""},{"$f":"IF(COUNTIF(Log!X:X,AR17)>0,\"X\",\"\")","v":""},{"$f":"IF(COUNTIF(Log!X:X,AS17)>0,\"X\",\"\")","v":""},{"$f":"IF(COUNTIF(Log!X:X,AT17)>0,\"X\",\"\")","v":""},"DB0DBP",{"$f":"IF(COUNTIF(Log!W:W,R18)>0,\"X\",\"\")","v":""},null,{"$f":"IF(COUNTIF(Log!AN:AN,\"Z00\")>0,\"X\",\"\")","v":""},null,null,null,null,null,null,null,"DF0DBP",null,"DA1","DB1","DC1","DD1","DF1","DG1","DH1","DJ1","DK1","DL1","DM1","DN1","DO1","DP1","DQ1","DR1"]
[1,{"$f":"IF(COUNTIF(Log!X:X,AE18)>0,\"X\",\"\")","v":""},{"$f":"IF(COUNTIF(Log!X:X,AF18)>0,\"X\",\"\")","v":""},{"$f":"IF(COUNTIF(Log!X:X,AG18)>0,\"X\",\"\")","v":""},{"$f":"IF(COUNTIF(Log!X:X,AH18)>0,\"X\",\"\")","v":""},{"$f":"IF(COUNTIF(Log!X:X,AI18)>0,\"X\",\"\")","v":""},{"$f":"IF(COUNTIF(Log!X:X,AJ18)>0,\"X\",\"\")","v":""},{"$f":"IF(COUNTIF(Log!X:X,AK18)>0,\"X\",\"\")","v":""},{"$f":"IF(COUNTIF(Log!X:X,AL18)>0,\"X\",\"\")","v":""},{"$f":"IF(COUNTIF(Log!X:X,AM18)>0,\"X\",\"\")","v":""},{"$f":"IF(COUNTIF(Log!X:X,AN18)>0,\"X\",\"\")","v":""},{"$f":"IF(COUNTIF(Log!X:X,AO18)>0,\"X\",\"\")","v":""},{"$f":"IF(COUNTIF(Log!X:X,AP18)>0,\"X\",\"\")","v":""},{"$f":"IF(COUNTIF(Log!X:X,AQ18)>0,\"X\",\"\")","v":""},{"$f":"IF(COUNTIF(Log!X:X,AR18)>0,\"X\",\"\")","v":""},{"$f":"IF(COUNTIF(Log!X:X,AS18)>0,\"X\",\"\")","v":""},{"$f":"IF(COUNTIF(Log!X:X,AT18)>0,\"X\",\"\")","v":""},"DF0DBP",{"$f":"IF(COUNTIF(Log!W:W,R19)>0,\"X\",\"\")","v":""},null,{"$f":"IF(COUNTIF(Log!AN:AN,\"Z00\")>0,\"X\",\"\")","v":""},null,null,null,null,null,null,null,"DK0DBP",null,"DA2","DB2","DC2","DD2","DF2","DG2","DH2","DJ2","DK2","DL2","DM2","DN2","DO2","DP2","DQ2","DR2"]
[2,{"$f":"IF(COUNTIF(Log!X:X,AE19)>0,\"X\",\"\")","v":""},{"$f":"IF(COUNTIF(Log!X:X,AF19)>0,\"X\",\"\")","v":""},{"$f":"IF(COUNTIF(Log!X:X,AG19)>0,\"X\",\"\")","v":""},{"$f":"IF(COUNTIF(Log!X:X,AH19)>0,\"X\",\"\")","v":""},{"$f":"IF(COUNTIF(Log!X:X,AI19)>0,\"X\",\"\")","v":""},{"$f":"IF(COUNTIF(Log!X:X,AJ19)>0,\"X\",\"\")","v":""},{"$f":"IF(COUNTIF(Log!X:X,AK19)>0,\"X\",\"\")","v":""},{"$f":"IF(COUNTIF(Log!X:X,AL19)>0,\"X\",\"\")","v":""},{"$f":"IF(COUNTIF(Log!X:X,AM19)>0,\"X\",\"\")","v":""},{"$f":"IF(COUNTIF(Log!X:X,AN19)>0,\"X\",\"\")","v":""},{"$f":"IF(COUNTIF(Log!X:X,AO19)>0,\"X\",\"\")","v":""},{"$f":"IF(COUNTIF(Log!X:X,AP19)>0,\"X\",\"\")","v":""},{"$f":"IF(COUNTIF(Log!X:X,AQ19)>0,\"X\",\"\")","v":""},{"$f":"IF(COUNTIF(Log!X:X,AR19)>0,\"X\",\"\")","v":""},{"$f":"IF(COUNTIF(Log!X:X,AS19)>0,\"X\",\"\")","v":""},{"$f":"IF(COUNTIF(Log!X:X,AT19)>0,\"X\",\"\")","v":""},"DK0DBP",{"$f":"IF(COUNTIF(Log!W:W,R20)>0,\"X\",\"\")","v":""},null,{"$f":"IF(COUNTIF(Log!AN:AN,\"Z00\")>0,\"X\",\"\")","v":""},null,null,null,null,null,null,null,"DL0DBP",null,"DA3","DB3","DC3","DD3","DF3","DG3","DH3","DJ3","DK3","DL3","DM3","DN3","DO3","DP3","DQ3","DR3"]
[3,{"$f":"IF(COUNTIF(Log!X:X,AE20)>0,\"X\",\"\")","v":""},{"$f":"IF(COUNTIF(Log!X:X,AF20)>0,\"X\",\"\")","v":""},{"$f":"IF(COUNTIF(Log!X:X,AG20)>0,\"X\",\"\")","v":""},{"$f":"IF(COUNTIF(Log!X:X,AH20)>0,\"X\",\"\")","v":""},{"$f":"IF(COUNTIF(Log!X:X,AI20)>0,\"X\",\"\")","v":""},{"$f":"IF(COUNTIF(Log!X:X,AJ20)>0,\"X\",\"\")","v":""},{"$f":"IF(COUNTIF(Log!X:X,AK20)>0,\"X\",\"\")","v":""},{"$f":"IF(COUNTIF(Log!X:X,AL20)>0,\"X\",\"\")","v":""},{"$f":"IF(COUNTIF(Log!X:X,AM20)>0,\"X\",\"\")","v":""},{"$f":"IF(COUNTIF(Log!X:X,AN20)>0,\"X\",\"\")","v":""},{"$f":"IF(COUNTIF(Log!X:X,AO20)>0,\"X\",\"\")","v":""},{"$f":"IF(COUNTIF(Log!X:X,AP20)>0,\"X\",\"\")","v":""},{"$f":"IF(COUNTIF(Log!X:X,AQ20)>0,\"X\",\"\")","v":""},{"$f":"IF(COUNTIF(Log!X:X,AR20)>0,\"X\",\"\")","v":""},{"$f":"IF(COUNTIF(Log!X:X,AS20)>0,\"X\",\"\")","v":""},{"$f":"IF(COUNTIF(Log!X:X,AT20)>0,\"X\",\"\")","v":""},"DL0DBP",{"$f":"IF(COUNTIF(Log!W:W,R21)>0,\"X\",\"\")","v":""},null,{"$f":"IF(COUNTIF(Log!AN:AN,\"Z00\")>0,\"X\",\"\")","v":""},null,null,null,null,null,null,null,"DL0Z",null,"DA4","DB4","DC4","DD4","DF4","DG4","DH4","DJ4","DK4","DL4","DM4","DN4","DO4","DP4","DQ4","DR4"]
[4,{"$f":"IF(COUNTIF(Log!X:X,AE21)>0,\"X\",\"\")","v":""},{"$f":"IF(COUNTIF(Log!X:X,AF21)>0,\"X\",\"\")","v":""},{"$f":"IF(COUNTIF(Log!X:X,AG21)>0,\"X\",\"\")","v":""},{"$f":"IF(COUNTIF(Log!X:X,AH21)>0,\"X\",\"\")","v":""},{"$f":"IF(COUNTIF(Log!X:X,AI21)>0,\"X\",\"\")","v":""},{"$f":"IF(COUNTIF(Log!X:X,AJ21)>0,\"X\",\"\")","v":""},{"$f":"IF(COUNTIF(Log!X:X,AK21)>0,\"X\",\"\")","v":""},{"$f":"IF(COUNTIF(Log!X:X,AL21)>0,\"X\",\"\")","v":""},{"$f":"IF(COUNTIF(Log!X:X,AM21)>0,\"X\",\"\")","v":""},{"$f":"IF(COUNTIF(Log!X:X,AN21)>0,\"X\",\"\")","v":""},{"$f":"IF(COUNTIF(Log!X:X,AO21)>0,\"X\",\"\")","v":""},{"$f":"IF(COUNTIF(Log!X:X,AP21)>0,\"X\",\"\")","v":""},{"$f":"IF(COUNTIF(Log!X:X,AQ21)>0,\"X\",\"\")","v":""},{"$f":"IF(COUNTIF(Log!X:X,AR21)>0,\"X\",\"\")","v":""},{"$f":"IF(COUNTIF(Log!X:X,AS21)>0,\"X\",\"\")","v":""},{"$f":"IF(COUNTIF(Log!X:X,AT21)>0,\"X\",\"\")","v":""},"DL0Z",{"$f":"IF(COUNTIF(Log!W:W,R22)>0,\"X\",\"\")","v":""},null,{"$f":"IF(COUNTIF(Log!AN:AN,\"Z00\")>0,\"X\",\"\")","v":""},null,null,null,null,null,null,null,"DQ0Z",null,"DA5","DB5","DC5","DD5","DF5","DG5","DH5","DJ5","DK5","DL5","DM5","DN5","DO5","DP5","DQ5","DR5"]
[5,{"$f":"IF(COUNTIF(Log!X:X,AE22)>0,\"X\",\"\")","v":""},{"$f":"IF(COUNTIF(Log!X:X,AF22)>0,\"X\",\"\")","v":""},{"$f":"IF(COUNTIF(Log!X:X,AG22)>0,\"X\",\"\")","v":""},{"$f":"IF(COUNTIF(Log!X:X,AH22)>0,\"X\",\"\")","v":""},{"$f":"IF(COUNTIF(Log!X:X,AI22)>0,\"X\",\"\")","v":""},{"$f":"IF(COUNTIF(Log!X:X,AJ22)>0,\"X\",\"\")","v":""},{"$f":"IF(COUNTIF(Log!X:X,AK22)>0,\"X\",\"\")","v":""},{"$f":"IF(COUNTIF(Log!X:X,AL22)>0,\"X\",\"\")","v":""},{"$f":"IF(COUNTIF(Log!X:X,AM22)>0,\"X\",\"\")","v":""},{"$f":"IF(COUNTIF(Log!X:X,AN22)>0,\"X\",\"\")","v":""},{"$f":"IF(COUNTIF(Log!X:X,AO22)>0,\"X\",\"\")","v":""},{"$f":"IF(COUNTIF(Log!X:X,AP22)>0,\"X\",\"\")","v":""},{"$f":"IF(COUNTIF(Log!X:X,AQ22)>0,\"X\",\"\")","v":""},{"$f":"IF(COUNTIF(Log!X:X,AR22)>0,\"X\",\"\")","v":""},{"$f":"IF(COUNTIF(Log!X:X,AS22)>0,\"X\",\"\")","v":""},{"$f":"IF(COUNTIF(Log!X:X,AT22)>0,\"X\",\"\")","v":""},"DQ0Z",{"$f":"IF(COUNTIF(Log!W:W,R23)>0,\"X\",\"\")","v":""},null,{"$f":"IF(COUNTIF(Log!AN:AN,\"Z00\")>0,\"X\",\"\")","v":""},null,null,null,null,null,null,null,"DF0FTP",null,"DA6","DB6","DC6","DD6","DF6","DG6","DH6","DJ6","DK6","DL6","DM6","DN6","DO6","DP6","DQ6","DR6"]
[6,{"$f":"IF(COUNTIF(Log!X:X,AE23)>0,\"X\",\"\")","v":""},{"$f":"IF(COUNTIF(Log!X:X,AF23)>0,\"X\",\"\")","v":""},{"$f":"IF(COUNTIF(Log!X:X,AG23)>0,\"X\",\"\")","v":""},{"$f":"IF(COUNTIF(Log!X:X,AH23)>0,\"X\",\"\")","v":""},{"$f":"IF(COUNTIF(Log!X:X,AI23)>0,\"X\",\"\")","v":""},{"$f":"IF(COUNTIF(Log!X:X,AJ23)>0,\"X\",\"\")","v":""},{"$f":"IF(COUNTIF(Log!X:X,AK23)>0,\"X\",\"\")","v":""},{"$f":"IF(COUNTIF(Log!X:X,AL23)>0,\"X\",\"\")","v":""},{"$f":"IF(COUNTIF(Log!X:X,AM23)>0,\"X\",\"\")","v":""},{"$f":"IF(COUNTIF(Log!X:X,AN23)>0,\"X\",\"\")","v":""},{"$f":"IF(COUNTIF(Log!X:X,AO23)>0,\"X\",\"\")","v":""},{"$f":"IF(COUNTIF(Log!X:X,AP23)>0,\"X\",\"\")","v":""},{"$f":"IF(COUNTIF(Log!X:X,AQ23)>0,\"X\",\"\")","v":""},{"$f":"IF(COUNTIF(Log!X:X,AR23)>0,\"X\",\"\")","v":""},{"$f":"IF(COUNTIF(Log!X:X,AS23)>0,\"X\",\"\")","v":""},{"$f":"IF(COUNTIF(Log!X:X,AT23)>0,\"X\",\"\")","v":""},"DF0FTP",{"$f":"IF(COUNTIF(Log!W:W,R24)>0,\"X\",\"\")","v":""},null,{"$f":"IF(COUNTIF(Log!AN:AN,\"Z00\")>0,\"X\",\"\")","v":""},null,null,null,null,null,null,null,"DL0FTP",null,"DA7","DB7","DC7","DD7","DF7","DG7","DH7","DJ7","DK7","DL7","DM7","DN7","DO7","DP7","DQ7","DR7"]
[7,{"$f":"IF(COUNTIF(Log!X:X,AE24)>0,\"X\",\"\")","v":""},{"$f":"IF(COUNTIF(Log!X:X,AF24)>0,\"X\",\"\")","v":""},{"$f":"IF(COUNTIF(Log!X:X,AG24)>0,\"X\",\"\")","v":""},{"$f":"IF(COUNTIF(Log!X:X,AH24)>0,\"X\",\"\")","v":""},{"$f":"IF(COUNTIF(Log!X:X,AI24)>0,\"X\",\"\")","v":""},{"$f":"IF(COUNTIF(Log!X:X,AJ24)>0,\"X\",\"\")","v":""},{"$f":"IF(COUNTIF(Log!X:X,AK24)>0,\"X\",\"\")","v":""},{"$f":"IF(COUNTIF(Log!X:X,AL24)>0,\"X\",\"\")","v":""},{"$f":"IF(COUNTIF(Log!X:X,AM24)>0,\"X\",\"\")","v":""},{"$f":"IF(COUNTIF(Log!X:X,AN24)>0,\"X\",\"\")","v":""},{"$f":"IF(COUNTIF(Log!X:X,AO24)>0,\"X\",\"\")","v":""},{"$f":"IF(COUNTIF(Log!X:X,AP24)>0,\"X\",\"\")","v":""},{"$f":"IF(COUNTIF(Log!X:X,AQ24)>0,\"X\",\"\")","v":""},{"$f":"IF(COUNTIF(Log!X:X,AR24)>0,\"X\",\"\")","v":""},{"$f":"IF(COUNTIF(Log!X:X,AS24)>0,\"X\",\"\")","v":""},{"$f":"IF(COUNTIF(Log!X:X,AT24)>0,\"X\",\"\")","v":""},"DL0FTP",{"$f":"IF(COUNTIF(Log!W:W,R25)>0,\"X\",\"\")","v":""},null,{"$f":"IF(COUNTIF(Log!AN:AN,\"Z00\")>0,\"X\",\"\")","v":""},null,null,null,null,null,null,null,"DL0YLZ",null,"DA8","DB8","DC8","DD8","DF8","DG8","DH8","DJ8","DK8","DL8","DM8","DN8","DO8","DP8","DQ8","DR8"]
[8,{"$f":"IF(COUNTIF(Log!X:X,AE25)>0,\"X\",\"\")","v":""},{"$f":"IF(COUNTIF(Log!X:X,AF25)>0,\"X\",\"\")","v":""},{"$f":"IF(COUNTIF(Log!X:X,AG25)>0,\"X\",\"\")","v":""},{"$f":"IF(COUNTIF(Log!X:X,AH25)>0,\"X\",\"\")","v":""},{"$f":"IF(COUNTIF(Log!X:X,AI25)>0,\"X\",\"\")","v":""},{"$f":"IF(COUNTIF(Log!X:X,AJ25)>0,\"X\",\"\")","v":""},{"$f":"IF(COUNTIF(Log!X:X,AK25)>0,\"X\",\"\")","v":""},{"$f":"IF(COUNTIF(Log!X:X,AL25)>0,\"X\",\"\")","v":""},{"$f":"IF(COUNTIF(Log!X:X,AM25)>0,\"X\",\"\")","v":""},{"$f":"IF(COUNTIF(Log!X:X,AN25)>0,\"X\",\"\")","v":""},{"$f":"IF(COUNTIF(Log!X:X,AO25)>0,\"X\",\"\")","v":""},{"$f":"IF(COUNTIF(Log!X:X,AP25)>0,\"X\",\"\")","v":""},{"$f":"IF(COUNTIF(Log!X:X,AQ25)>0,\"X\",\"\")","v":""},{"$f":"IF(COUNTIF(Log!X:X,AR25)>0,\"X\",\"\")","v":""},{"$f":"IF(COUNTIF(Log!X:X,AS25)>0,\"X\",\"\")","v":""},{"$f":"IF(COUNTIF(Log!X:X,AT25)>0,\"X\",\"\")","v":""},"DL0YLZ",{"$f":"IF(COUNTIF(Log!W:W,R26)>0,\"X\",\"\")","v":""},null,{"$f":"IF(COUNTIF(Log!AN:AN,\"Z00\")>0,\"X\",\"\")","v":""},null,null,null,null,null,null,null," ",null,"DA9","DB9","DC9","DD9","DF9","DG9","DH9","DJ9","DK9","DL9","DM9","DN9","DO9","DP9","DQ9","DR9"]
[9,{"$f":"IF(COUNTIF(Log!X:X,AE26)>0,\"X\",\"\")","v":""},{"$f":"IF(COUNTIF(Log!X:X,AF26)>0,\"X\",\"\")","v":""},{"$f":"IF(COUNTIF(Log!X:X,AG26)>0,\"X\",\"\")","v":""},{"$f":"IF(COUNTIF(Log!X:X,AH26)>0,\"X\",\"\")","v":""},{"$f":"IF(COUNTIF(Log!X:X,AI26)>0,\"X\",\"\")","v":""},{"$f":"IF(COUNTIF(Log!X:X,AJ26)>0,\"X\",\"\")","v":""},{"$f":"IF(COUNTIF(Log!X:X,AK26)>0,\"X\",\"\")","v":""},{"$f":"IF(COUNTIF(Log!X:X,AL26)>0,\"X\",\"\")","v":""},{"$f":"IF(COUNTIF(Log!X:X,AM26)>0,\"X\",\"\")","v":""},{"$f":"IF(COUNTIF(Log!X:X,AN26)>0,\"X\",\"\")","v":""},{"$f":"IF(COUNTIF(Log!X:X,AO26)>0,\"X\",\"\")","v":""},{"$f":"IF(COUNTIF(Log!X:X,AP26)>0,\"X\",\"\")","v":""},{"$f":"IF(COUNTIF(Log!X:X,AQ26)>0,\"X\",\"\")","v":""},{"$f":"IF(COUNTIF(Log!X:X,AR26)>0,\"X\",\"\")","v":""},{"$f":"IF(COUNTIF(Log!X:X,AS26)>0,\"X\",\"\")","v":""},{"$f":"IF(COUNTIF(Log!X:X,AT26)>0,\"X\",\"\")","v":""},null,{"$f":"IF(COUNTIF(Log!W:W,R27)>0,\"X\",\"\")","v":""},null,{"$f":"IF(COUNTIF(Log!AN:AN,\"Z00\")>0,\"X\",\"\")","v":""}]
[null,null,null,null,null,"Summe der Multis :",null,null,null,null,null,null,{"$f":"COUNTIF(B18:U27,\"X\")","v":0}]
[null,"Ich bestätige, daß die Lizenzbestimmungen und die Wettbewerbsregeln eingehalten wurden."]
[null,"Unterschrift :"]

{"sheet":"Log","index":2,"n_rows":506,"n_cols":26,"rows_kept":506,"cut":false,"hidden":false,"merged":[]}
[null,null,null,null,null,"VFDB-DLPX-Contest"]
[null,null,"Call der Station  : ",null,{"$f":"Allg_Angaben!C12","v":0},null,null,null,"Datum : ",null,{"$f":"date1","v":"2025-01-19"},null,null,null,null,null,null,null,null,null,null,null,null,"Log fertig"]
[null,null,null,null,null,null,null,null,"Band :   ",null,{"$f":"band1","v":"80m "},null,"Mode :",{"$f":"mode1","v":"CW"},null,null,null,null,null,"1 oder 0",null,null,null,null,null,"1 oder 0"]
[]
[null,"lfd.","Date","UTC","CALL","RST","RST","Lfd.Nr.","DOK","Band","Mode ","QSO","Multi","Bemerkung",null,"QSO-",null,"Präfix","SStn","doppeltes","DOK","UTC","Call","Präfix","Call +Band","dopp.Call"]
[null,"Nr.",null,"[hhmm]",null,"geg.","erh.","erh.",null,80,null,"Pkt","Pkt",null,null,"Zahl",null,"Pkt","Pkt","Call?Band","gross","[hmm]","gross","XXX",null,"unabh.Band"]
[null,1,{"$f":"IF(F7>0,date1,\"\")","v":""},null,null,null,null,null,null,null,{"$f":"mode1","v":"CW"},{"$f":"IF(E7=\"\",\"\",IF(T7=1,1,0))","v":""},{"$f":"IF(E7=\"\",\"\",R7+S7)","v":""},{"$f":"IF(E7=\"\",\"\",IF(T7=0,\"doppeltes Call\",\"\"))","v":""},null,{"$f":"IF(F7>0,1,0)","v":0},null,{"$f":"IF(COUNTIF($X$6:$X7,X7)=1,1,0)","v":0},{"$f":"IF(COUNTIF(SSTN,W7)=1,IF(Z7=0,0,1),0)","v":0},{"$f":"IF(COUNTIF($Y$7:$Y7,Y7)=1,1,0)","v":1},{"$f":"UPPER(SUBSTITUTE(I7,\" \",\"\",1))","v":""},{"$f":"CONCATENATE(LEFT(D7,2),\":\",RIGHT(D7,2))","v":":"},{"$f":"UPPER(E7)","v":""},{"$f":"IF(LEFT(W7,1)=\"D\",LEFT(W7,3),\"XXX\")","v":"XXX"},{"$f":"CONCATENATE(W7,(LEFT(J7,1)))","v":""},{"$f":"IF(COUNTIF($W$6:$W7,$W7)=1,1,0)","v":1}]
[null,2,"",null,null,null,null,null,null,null,null,{"$f":"IF(E8=\"\",\"\",IF(T8=1,1,0))","v":""},"","",null,{"$f":"IF(F8>0,1,0)","v":0},null,{"$f":"IF(COUNTIF($X$6:$X8,X8)=1,1,0)","v":0},0,{"$f":"IF(COUNTIF($Y$7:$Y8,Y8)=1,1,0)","v":0},"",":","","XXX","",{"$f":"IF(COUNTIF($W$6:$W8,$W8)=1,1,0)","v":0}]
[null,3,"",null,null,null,null,null,null,null,null,{"$f":"IF(E9=\"\",\"\",IF(T9=1,1,0))","v":""},"","",null,0,null,{"$f":"IF(COUNTIF($X$6:$X9,X9)=1,1,0)","v":0},0,{"$f":"IF(COUNTIF($Y$7:$Y9,Y9)=1,1,0)","v":0},"",":","","XXX","",{"$f":"IF(COUNTIF($W$6:$W9,$W9)=1,1,0)","v":0}]
[null,4,"",null,null,null,null,null,null,null,null,{"$f":"IF(E10=\"\",\"\",IF(T10=1,1,0))","v":""},"","",null,0,null,{"$f":"IF(COUNTIF($X$6:$X10,X10)=1,1,0)","v":0},0,{"$f":"IF(COUNTIF($Y$7:$Y10,Y10)=1,1,0)","v":0},"",":","","XXX","",{"$f":"IF(COUNTIF($W$6:$W10,$W10)=1,1,0)","v":0}]
[null,5,"",null,null,null,null,null,null,null,null,"","","",null,0,null,{"$f":"IF(COUNTIF($X$6:$X11,X11)=1,1,0)","v":0},0,{"$f":"IF(COUNTIF($Y$7:$Y11,Y11)=1,1,0)","v":0},"",":","","XXX","",{"$f":"IF(COUNTIF($W$6:$W11,$W11)=1,1,0)","v":0}]
[null,6,"",null,null,null,null,null,null,null,null,"","","",null,0,null,{"$f":"IF(COUNTIF($X$6:$X12,X12)=1,1,0)","v":0},0,{"$f":"IF(COUNTIF($Y$7:$Y12,Y12)=1,1,0)","v":0},"",":","","XXX","",{"$f":"IF(COUNTIF($W$6:$W12,$W12)=1,1,0)","v":0}]
[null,7,"",null,null,null,null,null,null,null,null,"","","",null,0,null,{"$f":"IF(COUNTIF($X$6:$X13,X13)=1,1,0)","v":0},0,{"$f":"IF(COUNTIF($Y$7:$Y13,Y13)=1,1,0)","v":0},{"$f":"UPPER(SUBSTITUTE(I13,\" \",\"\",1))","v":""},{"$f":"CONCATENATE(LEFT(D13,2),\":\",RIGHT(D13,2))","v":":"},{"$f":"UPPER(E13)","v":""},"XXX",{"$f":"CONCATENATE(W13,(LEFT(J13,1)))","v":""},{"$f":"IF(COUNTIF($W$6:$W13,$W13)=1,1,0)","v":0}]
[null,8,"",null,null,null,null,null,null,null,null,"","","",null,0,null,{"$f":"IF(COUNTIF($X$6:$X14,X14)=1,1,0)","v":0},0,{"$f":"IF(COUNTIF($Y$7:$Y14,Y14)=1,1,0)","v":0},{"$f":"UPPER(SUBSTITUTE(I14,\" \",\"\",1))","v":""},{"$f":"CONCATENATE(LEFT(D14,2),\":\",RIGHT(D14,2))","v":":"},{"$f":"UPPER(E14)","v":""},"XXX",{"$f":"CONCATENATE(W14,(LEFT(J14,1)))","v":""},{"$f":"IF(COUNTIF($W$6:$W14,$W14)=1,1,0)","v":0}]
[null,9,"",null,null,null,null,null,null,null,null,"",{"$f":"IF(E15=\"\",\"\",R15+S15)","v":""},{"$f":"IF(E15=\"\",\"\",IF(T15=0,\"doppeltes Call\",\"\"))","v":""},null,0,null,{"$f":"IF(COUNTIF($X$6:$X15,X15)=1,1,0)","v":0},0,{"$f":"IF(COUNTIF($Y$7:$Y15,Y15)=1,1,0)","v":0},{"$f":"UPPER(SUBSTITUTE(I15,\" \",\"\",1))","v":""},{"$f":"CONCATENATE(LEFT(D15,2),\":\",RIGHT(D15,2))","v":":"},{"$f":"UPPER(E15)","v":""},"XXX",{"$f":"CONCATENATE(W15,(LEFT(J15,1)))","v":""},{"$f":"IF(COUNTIF($W$6:$W15,$W15)=1,1,0)","v":0}]
[null,10,"",null,null,null,null,null,null,null,null,{"$f":"IF(E16=\"\",\"\",IF(T16=1,1,0))","v":""},{"$f":"IF(E16=\"\",\"\",R16+S16)","v":""},{"$f":"IF(E16=\"\",\"\",IF(T16=0,\"doppeltes Call\",\"\"))","v":""},null,0,null,{"$f":"IF(COUNTIF($X$6:$X16,X16)=1,1,0)","v":0},{"$f":"IF(COUNTIF(SSTN,W16)=1,IF(Z16=0,0,1),0)","v":0},{"$f":"IF(COUNTIF($Y$7:$Y16,Y16)=1,1,0)","v":0},{"$f":"UPPER(SUBSTITUTE(I16,\" \",\"\",1))","v":""},{"$f":"CONCATENATE(LEFT(D16,2),\":\",RIGHT(D16,2))","v":":"},{"$f":"UPPER(E16)","v":""},{"$f":"IF(LEFT(W16,1)=\"D\",LEFT(W16,3),\"XXX\")","v":"XXX"},{"$f":"CONCATENATE(W16,(LEFT(J16,1)))","v":""},{"$f":"IF(COUNTIF($W$6:$W16,$W16)=1,1,0)","v":0}]
[null,11,"",null,null,null,null,null,null,null,null,"","","",null,0,null,{"$f":"IF(COUNTIF($X$6:$X17,X17)=1,1,0)","v":0},0,{"$f":"IF(COUNTIF($Y$7:$Y17,Y17)=1,1,0)","v":0},"",":","","XXX","",{"$f":"IF(COUNTIF($W$6:$W17,$W17)=1,1,0)","v":0}]
[null,12,"",null,null,null,null,null,null,null,null,"","","",null,0,null,{"$f":"IF(COUNTIF($X$6:$X18,X18)=1,1,0)","v":0},0,{"$f":"IF(COUNTIF($Y$7:$Y18,Y18)=1,1,0)","v":0},"",":","","XXX","",{"$f":"IF(COUNTIF($W$6:$W18,$W18)=1,1,0)","v":0}]
[null,13,"",null,null,null,null,null,null,null,null,"","","",null,0,null,{"$f":"IF(COUNTIF($X$6:$X19,X19)=1,1,0)","v":0},0,{"$f":"IF(COUNTIF($Y$7:$Y19,Y19)=1,1,0)","v":0},"",":","","XXX","",{"$f":"IF(COUNTIF($W$6:$W19,$W19)=1,1,0)","v":0}]
[null,14,"",null,null,null,null,null,null,null,null,"","","",null,0,null,{"$f":"IF(COUNTIF($X$6:$X20,X20)=1,1,0)","v":0},0,{"$f":"IF(COUNTIF($Y$7:$Y20,Y20)=1,1,0)","v":0},"",":","","XXX","",{"$f":"IF(COUNTIF($W$6:$W20,$W20)=1,1,0)","v":0}]
[null,15,"",null,null,null,null,null,null,null,null,"","","",null,0,null,{"$f":"IF(COUNTIF($X$6:$X21,X21)=1,1,0)","v":0},0,{"$f":"IF(COUNTIF($Y$7:$Y21,Y21)=1,1,0)","v":0},"",":","","XXX","",{"$f":"IF(COUNTIF($W$6:$W21,$W21)=1,1,0)","v":0}]
[null,16,"",null,null,null,null,null,null,null,null,"","","",null,0,null,{"$f":"IF(COUNTIF($X$6:$X22,X22)=1,1,0)","v":0},0,{"$f":"IF(COUNTIF($Y$7:$Y22,Y22)=1,1,0)","v":0},"",":","","XXX","",{"$f":"IF(COUNTIF($W$6:$W22,$W22)=1,1,0)","v":0}]
[null,17,"",null,null,null,null,null,null,null,null,"","","",null,0,null,{"$f":"IF(COUNTIF($X$6:$X23,X23)=1,1,0)","v":0},0,{"$f":"IF(COUNTIF($Y$7:$Y23,Y23)=1,1,0)","v":0},"",":","","XXX","",{"$f":"IF(COUNTIF($W$6:$W23,$W23)=1,1,0)","v":0}]
[null,18,"",null,null,null,null,null,null,null,null,"","","",null,0,null,{"$f":"IF(COUNTIF($X$6:$X24,X24)=1,1,0)","v":0},0,{"$f":"IF(COUNTIF($Y$7:$Y24,Y24)=1,1,0)","v":0},"",":","","XXX","",{"$f":"IF(COUNTIF($W$6:$W24,$W24)=1,1,0)","v":0}]
[null,19,"",null,null,null,null,null,null,null,null,"","","",null,0,null,{"$f":"IF(COUNTIF($X$6:$X25,X25)=1,1,0)","v":0},0,{"$f":"IF(COUNTIF($Y$7:$Y25,Y25)=1,1,0)","v":0},"",":","","XXX","",{"$f":"IF(COUNTIF($W$6:$W25,$W25)=1,1,0)","v":0}]
[null,20,"",null,null,null,null,null,null,null,null,"","","",null,0,null,{"$f":"IF(COUNTIF($X$6:$X26,X26)=1,1,0)","v":0},0,{"$f":"IF(COUNTIF($Y$7:$Y26,Y26)=1,1,0)","v":0},"",":","","XXX","",{"$f":"IF(COUNTIF($W$6:$W26,$W26)=1,1,0)","v":0}]
[null,21,"",":","",null,null,null,"",null,null,"","","",null,0,null,{"$f":"IF(COUNTIF($X$6:$X27,X27)=1,1,0)","v":0},0,{"$f":"IF(COUNTIF($Y$7:$Y27,Y27)=1,1,0)","v":0},"",":::","","XXX","",{"$f":"IF(COUNTIF($W$6:$W27,$W27)=1,1,0)","v":0}]
[null,22,"",":","",null,null,null,"",null,null,"","","",null,0,null,{"$f":"IF(COUNTIF($X$6:$X28,X28)=1,1,0)","v":0},0,{"$f":"IF(COUNTIF($Y$7:$Y28,Y28)=1,1,0)","v":0},"",":::","","XXX","",{"$f":"IF(COUNTIF($W$6:$W28,$W28)=1,1,0)","v":0}]
[null,23,"",":","",null,null,null,"",null,null,"","","",null,0,null,{"$f":"IF(COUNTIF($X$6:$X29,X29)=1,1,0)","v":0},0,{"$f":"IF(COUNTIF($Y$7:$Y29,Y29)=1,1,0)","v":0},"",":::","","XXX","",{"$f":"IF(COUNTIF($W$6:$W29,$W29)=1,1,0)","v":0}]
[null,24,"",":","",null,null,null,"",null,null,"","","",null,0,null,{"$f":"IF(COUNTIF($X$6:$X30,X30)=1,1,0)","v":0},0,{"$f":"IF(COUNTIF($Y$7:$Y30,Y30)=1,1,0)","v":0},"",":::","","XXX","",{"$f":"IF(COUNTIF($W$6:$W30,$W30)=1,1,0)","v":0}]
[null,25,"",":","",null,null,null,"",null,null,"","","",null,0,null,{"$f":"IF(COUNTIF($X$6:$X31,X31)=1,1,0)","v":0},0,{"$f":"IF(COUNTIF($Y$7:$Y31,Y31)=1,1,0)","v":0},"",":::","","XXX","",{"$f":"IF(COUNTIF($W$6:$W31,$W31)=1,1,0)","v":0}]
[null,26,"",":","",null,null,null,"",null,null,"","","",null,0,null,{"$f":"IF(COUNTIF($X$6:$X32,X32)=1,1,0)","v":0},0,{"$f":"IF(COUNTIF($Y$7:$Y32,Y32)=1,1,0)","v":0},"",":::","","XXX","",{"$f":"IF(COUNTIF($W$6:$W32,$W32)=1,1,0)","v":0}]
[null,27,"",":","",null,null,null,"",null,null,"","","",null,0,null,{"$f":"IF(COUNTIF($X$6:$X33,X33)=1,1,0)","v":0},0,{"$f":"IF(COUNTIF($Y$7:$Y33,Y33)=1,1,0)","v":0},"",":::","","XXX","",{"$f":"IF(COUNTIF($W$6:$W33,$W33)=1,1,0)","v":0}]
[null,28,"",":","",null,null,null,"",null,null,"","","",null,0,null,{"$f":"IF(COUNTIF($X$6:$X34,X34)=1,1,0)","v":0},0,{"$f":"IF(COUNTIF($Y$7:$Y34,Y34)=1,1,0)","v":0},"",":::","","XXX","",{"$f":"IF(COUNTIF($W$6:$W34,$W34)=1,1,0)","v":0}]
[null,29,"",":","",null,null,null,"",null,null,"","","",null,0,null,{"$f":"IF(COUNTIF($X$6:$X35,X35)=1,1,0)","v":0},0,{"$f":"IF(COUNTIF($Y$7:$Y35,Y35)=1,1,0)","v":0},"",":::","","XXX","",{"$f":"IF(COUNTIF($W$6:$W35,$W35)=1,1,0)","v":0}]
[null,30,"",":","",null,null,null,"",null,null,"","","",null,0,null,{"$f":"IF(COUNTIF($X$6:$X36,X36)=1,1,0)","v":0},0,{"$f":"IF(COUNTIF($Y$7:$Y36,Y36)=1,1,0)","v":0},"",":::","","XXX","",{"$f":"IF(COUNTIF($W$6:$W36,$W36)=1,1,0)","v":0}]
[null,31,"",":","",null,null,null,"",null,null,"","","",null,0,null,{"$f":"IF(COUNTIF($X$6:$X37,X37)=1,1,0)","v":0},0,{"$f":"IF(COUNTIF($Y$7:$Y37,Y37)=1,1,0)","v":0},"",":::","","XXX","",{"$f":"IF(COUNTIF($W$6:$W37,$W37)=1,1,0)","v":0}]
[null,32,"",":","",null,null,null,"",null,null,"","","",null,0,null,{"$f":"IF(COUNTIF($X$6:$X38,X38)=1,1,0)","v":0},0,{"$f":"IF(COUNTIF($Y$7:$Y38,Y38)=1,1,0)","v":0},"",":::","","XXX","",{"$f":"IF(COUNTIF($W$6:$W38,$W38)=1,1,0)","v":0}]
[null,33,"",":","",null,null,null,"",null,null,"","","",null,0,null,{"$f":"IF(COUNTIF($X$6:$X39,X39)=1,1,0)","v":0},0,{"$f":"IF(COUNTIF($Y$7:$Y39,Y39)=1,1,0)","v":0},"",":::","","XXX","",{"$f":"IF(COUNTIF($W$6:$W39,$W39)=1,1,0)","v":0}]
[null,34,"",":","",null,null,null,"",null,null,"","","",null,0,null,{"$f":"IF(COUNTIF($X$6:$X40,X40)=1,1,0)","v":0},0,{"$f":"IF(COUNTIF($Y$7:$Y40,Y40)=1,1,0)","v":0},"",":::","","XXX","",{"$f":"IF(COUNTIF($W$6:$W40,$W40)=1,1,0)","v":0}]
[null,35,"",":","",null,null,null,"",null,null,"","","",null,0,null,{"$f":"IF(COUNTIF($X$6:$X41,X41)=1,1,0)","v":0},0,{"$f":"IF(COUNTIF($Y$7:$Y41,Y41)=1,1,0)","v":0},"",":::","","XXX","",{"$f":"IF(COUNTIF($W$6:$W41,$W41)=1,1,0)","v":0}]
[null,36,"",":","",null,null,null,"",null,null,"","","",null,0,null,{"$f":"IF(COUNTIF($X$6:$X42,X42)=1,1,0)","v":0},0,{"$f":"IF(COUNTIF($Y$7:$Y42,Y42)=1,1,0)","v":0},"",":::","","XXX","",{"$f":"IF(COUNTIF($W$6:$W42,$W42)=1,1,0)","v":0}]
[null,37,"",":","",null,null,null,"",null,null,"","","",null,0,null,{"$f":"IF(COUNTIF($X$6:$X43,X43)=1,1,0)","v":0},0,{"$f":"IF(COUNTIF($Y$7:$Y43,Y43)=1,1,0)","v":0},"",":::","","XXX","",{"$f":"IF(COUNTIF($W$6:$W43,$W43)=1,1,0)","v":0}]
[null,38,"",":::","",null,null,null,"",null,null,"","","",null,0,null,{"$f":"IF(COUNTIF($X$6:$X44,X44)=1,1,0)","v":0},0,{"$f":"IF(COUNTIF($Y$7:$Y44,Y44)=1,1,0)","v":0},"",":::::","","XXX","",{"$f":"IF(COUNTIF($W$6:$W44,$W44)=1,1,0)","v":0}]
[null,39,"",":::","",null,null,null,"",null,null,"","","",null,0,null,{"$f":"IF(COUNTIF($X$6:$X45,X45)=1,1,0)","v":0},0,{"$f":"IF(COUNTIF($Y$7:$Y45,Y45)=1,1,0)","v":0},"",":::::","","XXX","",{"$f":"IF(COUNTIF($W$6:$W45,$W45)=1,1,0)","v":0}]
[null,40,"",":::","",null,null,null,"",null,null,"","","",null,0,null,{"$f":"IF(COUNTIF($X$6:$X46,X46)=1,1,0)","v":0},0,{"$f":"IF(COUNTIF($Y$7:$Y46,Y46)=1,1,0)","v":0},"",":::::","","XXX","",{"$f":"IF(COUNTIF($W$6:$W46,$W46)=1,1,0)","v":0}]
[null,41,"",":::","",null,null,null,"",null,null,"","","",null,0,null,{"$f":"IF(COUNTIF($X$6:$X47,X47)=1,1,0)","v":0},0,{"$f":"IF(COUNTIF($Y$7:$Y47,Y47)=1,1,0)","v":0},"",":::::","","XXX","",{"$f":"IF(COUNTIF($W$6:$W47,$W47)=1,1,0)","v":0}]
[null,42,"",":::","",null,null,null,"",null,null,"","","",null,0,null,{"$f":"IF(COUNTIF($X$6:$X48,X48)=1,1,0)","v":0},0,{"$f":"IF(COUNTIF($Y$7:$Y48,Y48)=1,1,0)","v":0},"",":::::","","XXX","",{"$f":"IF(COUNTIF($W$6:$W48,$W48)=1,1,0)","v":0}]
[null,43,"",":::","",null,null,null,"",null,null,"","","",null,0,null,{"$f":"IF(COUNTIF($X$6:$X49,X49)=1,1,0)","v":0},0,{"$f":"IF(COUNTIF($Y$7:$Y49,Y49)=1,1,0)","v":0},"",":::::","","XXX","",{"$f":"IF(COUNTIF($W$6:$W49,$W49)=1,1,0)","v":0}]
[null,44,"",":::","",null,null,null,"",null,null,"","","",null,0,null,{"$f":"IF(COUNTIF($X$6:$X50,X50)=1,1,0)","v":0},0,{"$f":"IF(COUNTIF($Y$7:$Y50,Y50)=1,1,0)","v":0},"",":::::","","XXX","",{"$f":"IF(COUNTIF($W$6:$W50,$W50)=1,1,0)","v":0}]
[null,45,"",":::","",null,null,null,"",null,null,"","","",null,0,null,{"$f":"IF(COUNTIF($X$6:$X51,X51)=1,1,0)","v":0},0,{"$f":"IF(COUNTIF($Y$7:$Y51,Y51)=1,1,0)","v":0},"",":::::","","XXX","",{"$f":"IF(COUNTIF($W$6:$W51,$W51)=1,1,0)","v":0}]
[null,46,"",":::","",null,null,null,"",null,null,"","","",null,0,null,{"$f":"IF(COUNTIF($X$6:$X52,X52)=1,1,0)","v":0},0,{"$f":"IF(COUNTIF($Y$7:$Y52,Y52)=1,1,0)","v":0},"",":::::","","XXX","",{"$f":"IF(COUNTIF($W$6:$W52,$W52)=1,1,0)","v":0}]
[null,47,"",":::","",null,null,null,"",null,null,"","","",null,0,null,{"$f":"IF(COUNTIF($X$6:$X53,X53)=1,1,0)","v":0},0,{"$f":"IF(COUNTIF($Y$7:$Y53,Y53)=1,1,0)","v":0},"",":::::","","XXX","",{"$f":"IF(COUNTIF($W$6:$W53,$W53)=1,1,0)","v":0}]
[null,48,"",":::","",null,null,null,"",null,null,"","","",null,0,null,{"$f":"IF(COUNTIF($X$6:$X54,X54)=1,1,0)","v":0},0,{"$f":"IF(COUNTIF($Y$7:$Y54,Y54)=1,1,0)","v":0},"",":::::","","XXX","",{"$f":"IF(COUNTIF($W$6:$W54,$W54)=1,1,0)","v":0}]
[null,49,"",":::","",null,null,null,"",null,null,"","","",null,0,null,{"$f":"IF(COUNTIF($X$6:$X55,X55)=1,1,0)","v":0},0,{"$f":"IF(COUNTIF($Y$7:$Y55,Y55)=1,1,0)","v":0},"",":::::","","XXX","",{"$f":"IF(COUNTIF($W$6:$W55,$W55)=1,1,0)","v":0}]
[null,50,"",":::","",null,null,null,"",null,null,"","","",null,0,null,{"$f":"IF(COUNTIF($X$6:$X56,X56)=1,1,0)","v":0},0,{"$f":"IF(COUNTIF($Y$7:$Y56,Y56)=1,1,0)","v":0},"",":::::","","XXX","",{"$f":"IF(COUNTIF($W$6:$W56,$W56)=1,1,0)","v":0}]
[null,51,"",":::","",null,null,null,"",null,null,"","","",null,0,null,{"$f":"IF(COUNTIF($X$6:$X57,X57)=1,1,0)","v":0},0,{"$f":"IF(COUNTIF($Y$7:$Y57,Y57)=1,1,0)","v":0},"",":::::","","XXX","",{"$f":"IF(COUNTIF($W$6:$W57,$W57)=1,1,0)","v":0}]
[null,52,"",":::","",null,null,null,"",null,null,"","","",null,0,null,{"$f":"IF(COUNTIF($X$6:$X58,X58)=1,1,0)","v":0},0,{"$f":"IF(COUNTIF($Y$7:$Y58,Y58)=1,1,0)","v":0},"",":::::","","XXX","",{"$f":"IF(COUNTIF($W$6:$W58,$W58)=1,1,0)","v":0}]
[null,53,"",":::","",null,null,null,"",null,null,"","","",null,0,null,{"$f":"IF(COUNTIF($X$6:$X59,X59)=1,1,0)","v":0},0,{"$f":"IF(COUNTIF($Y$7:$Y59,Y59)=1,1,0)","v":0},"",":::::","","XXX","",{"$f":"IF(COUNTIF($W$6:$W59,$W59)=1,1,0)","v":0}]
[null,54,"",":::","",null,null,null,"",null,null,"","","",null,0,null,{"$f":"IF(COUNTIF($X$6:$X60,X60)=1,1,0)","v":0},0,{"$f":"IF(COUNTIF($Y$7:$Y60,Y60)=1,1,0)","v":0},"",":::::","","XXX","",{"$f":"IF(COUNTIF($W$6:$W60,$W60)=1,1,0)","v":0}]
[null,55,"",":::","",null,null,null,"",null,null,"","","",null,0,null,{"$f":"IF(COUNTIF($X$6:$X61,X61)=1,1,0)","v":0},0,{"$f":"IF(COUNTIF($Y$7:$Y61,Y61)=1,1,0)","v":0},"",":::::","","XXX","",{"$f":"IF(COUNTIF($W$6:$W61,$W61)=1,1,0)","v":0}]
[null,56,"",":::","",null,null,null,"",null,null,"","","",null,0,null,{"$f":"IF(COUNTIF($X$6:$X62,X62)=1,1,0)","v":0},0,{"$f":"IF(COUNTIF($Y$7:$Y62,Y62)=1,1,0)","v":0},"",":::::","","XXX","",{"$f":"IF(COUNTIF($W$6:$W62,$W62)=1,1,0)","v":0}]
[null,57,"",":::","",null,null,null,"",null,null,"","","",null,0,null,{"$f":"IF(COUNTIF($X$6:$X63,X63)=1,1,0)","v":0},0,{"$f":"IF(COUNTIF($Y$7:$Y63,Y63)=1,1,0)","v":0},"",":::::","","XXX","",{"$f":"IF(COUNTIF($W$6:$W63,$W63)=1,1,0)","v":0}]
[null,58,"",":::","",null,null,null,"",null,null,"","","",null,0,null,{"$f":"IF(COUNTIF($X$6:$X64,X64)=1,1,0)","v":0},0,{"$f":"IF(COUNTIF($Y$7:$Y64,Y64)=1,1,0)","v":0},"",":::::","","XXX","",{"$f":"IF(COUNTIF($W$6:$W64,$W64)=1,1,0)","v":0}]
[null,59,"",":::","",null,null,null,"",null,null,"","","",null,0,null,{"$f":"IF(COUNTIF($X$6:$X65,X65)=1,1,0)","v":0},0,{"$f":"IF(COUNTIF($Y$7:$Y65,Y65)=1,1,0)","v":0},"",":::::","","XXX","",{"$f":"IF(COUNTIF($W$6:$W65,$W65)=1,1,0)","v":0}]
[null,60,"",":::","",null,null,null,"",null,null,"","","",null,0,null,{"$f":"IF(COUNTIF($X$6:$X66,X66)=1,1,0)","v":0},0,{"$f":"IF(COUNTIF($Y$7:$Y66,Y66)=1,1,0)","v":0},"",":::::","","XXX","",{"$f":"IF(COUNTIF($W$6:$W66,$W66)=1,1,0)","v":0}]
[null,61,"",":::","",null,null,null,"",null,null,"","","",null,0,null,{"$f":"IF(COUNTIF($X$6:$X67,X67)=1,1,0)","v":0},0,{"$f":"IF(COUNTIF($Y$7:$Y67,Y67)=1,1,0)","v":0},"",":::::","","XXX","",{"$f":"IF(COUNTIF($W$6:$W67,$W67)=1,1,0)","v":0}]
[null,62,"",":::","",null,null,null,"",null,null,"","","",null,0,null,{"$f":"IF(COUNTIF($X$6:$X68,X68)=1,1,0)","v":0},0,{"$f":"IF(COUNTIF($Y$7:$Y68,Y68)=1,1,0)","v":0},"",":::::","","XXX","",{"$f":"IF(COUNTIF($W$6:$W68,$W68)=1,1,0)","v":0}]
[null,63,"",":::","",null,null,null,"",null,null,"","","",null,0,null,{"$f":"IF(COUNTIF($X$6:$X69,X69)=1,1,0)","v":0},0,{"$f":"IF(COUNTIF($Y$7:$Y69,Y69)=1,1,0)","v":0},"",":::::","","XXX","",{"$f":"IF(COUNTIF($W$6:$W69,$W69)=1,1,0)","v":0}]
[null,64,"",":::","",null,null,null,"",null,null,"","","",null,0,null,{"$f":"IF(COUNTIF($X$6:$X70,X70)=1,1,0)","v":0},0,{"$f":"IF(COUNTIF($Y$7:$Y70,Y70)=1,1,0)","v":0},"",":::::","","XXX","",{"$f":"IF(COUNTIF($W$6:$W70,$W70)=1,1,0)","v":0}]
[null,65,{"$f":"IF(F71>0,date1,\"\")","v":""},":::","",null,null,null,"",null,null,"","","",null,0,null,{"$f":"IF(COUNTIF($X$6:$X71,X71)=1,1,0)","v":0},0,{"$f":"IF(COUNTIF($Y$7:$Y71,Y71)=1,1,0)","v":0},"",":::::","","XXX","",{"$f":"IF(COUNTIF($W$6:$W71,$W71)=1,1,0)","v":0}]
[null,66,"",":::","",null,null,null,"",null,null,"","","",null,{"$f":"IF(F72>0,1,0)","v":0},null,{"$f":"IF(COUNTIF($X$6:$X72,X72)=1,1,0)","v":0},0,{"$f":"IF(COUNTIF($Y$7:$Y72,Y72)=1,1,0)","v":0},"",":::::","","XXX","",{"$f":"IF(COUNTIF($W$6:$W72,$W72)=1,1,0)","v":0}]
[null,67,"",":::","",null,null,null,"",null,null,"","","",null,0,null,{"$f":"IF(COUNTIF($X$6:$X73,X73)=1,1,0)","v":0},0,{"$f":"IF(COUNTIF($Y$7:$Y73,Y73)=1,1,0)","v":0},"",":::::","","XXX","",{"$f":"IF(COUNTIF($W$6:$W73,$W73)=1,1,0)","v":0}]
[null,68,"",":::","",null,null,null,"",null,null,"","","",null,0,null,{"$f":"IF(COUNTIF($X$6:$X74,X74)=1,1,0)","v":0},0,{"$f":"IF(COUNTIF($Y$7:$Y74,Y74)=1,1,0)","v":0},"",":::::","","XXX","",{"$f":"IF(COUNTIF($W$6:$W74,$W74)=1,1,0)","v":0}]
[null,69,"",":::","",null,null,null,"",null,null,"","","",null,0,null,{"$f":"IF(COUNTIF($X$6:$X75,X75)=1,1,0)","v":0},0,{"$f":"IF(COUNTIF($Y$7:$Y75,Y75)=1,1,0)","v":0},"",":::::","","XXX","",{"$f":"IF(COUNTIF($W$6:$W75,$W75)=1,1,0)","v":0}]
[null,70,"",":::","",null,null,null,"",null,null,"","","",null,0,null,{"$f":"IF(COUNTIF($X$6:$X76,X76)=1,1,0)","v":0},0,{"$f":"IF(COUNTIF($Y$7:$Y76,Y76)=1,1,0)","v":0},"",":::::","","XXX","",{"$f":"IF(COUNTIF($W$6:$W76,$W76)=1,1,0)","v":0}]
[null,71,"",":::","",null,null,null,"",null,null,"","","",null,0,null,{"$f":"IF(COUNTIF($X$6:$X77,X77)=1,1,0)","v":0},0,{"$f":"IF(COUNTIF($Y$7:$Y77,Y77)=1,1,0)","v":0},"",":::::","","XXX","",{"$f":"IF(COUNTIF($W$6:$W77,$W77)=1,1,0)","v":0}]
[null,72,"",":::","",null,null,null,"",null,null,"","","",null,0,null,{"$f":"IF(COUNTIF($X$6:$X78,X78)=1,1,0)","v":0},0,{"$f":"IF(COUNTIF($Y$7:$Y78,Y78)=1,1,0)","v":0},"",":::::","","XXX","",{"$f":"IF(COUNTIF($W$6:$W78,$W78)=1,1,0)","v":0}]
[null,73,"",":::","",null,null,null,"",null,null,"","","",null,0,null,{"$f":"IF(COUNTIF($X$6:$X79,X79)=1,1,0)","v":0},0,{"$f":"IF(COUNTIF($Y$7:$Y79,Y79)=1,1,0)","v":0},"",":::::","","XXX","",{"$f":"IF(COUNTIF($W$6:$W79,$W79)=1,1,0)","v":0}]
[null,74,"",":::","",null,null,null,"",null,null,{"$f":"IF(E80=\"\",\"\",IF(T80=1,1,0))","v":""},{"$f":"IF(E80=\"\",\"\",R80+S80)","v":""},{"$f":"IF(E80=\"\",\"\",IF(T80=0,\"doppeltes Call\",\"\"))","v":""},null,0,null,{"$f":"IF(COUNTIF($X$6:$X80,X80)=1,1,0)","v":0},{"$f":"IF(COUNTIF(SSTN,W80)=1,IF(Z80=0,0,1),0)","v":0},{"$f":"IF(COUNTIF($Y$7:$Y80,Y80)=1,1,0)","v":0},{"$f":"UPPER(SUBSTITUTE(I80,\" \",\"\",1))","v":""},{"$f":"CONCATENATE(LEFT(D80,2),\":\",RIGHT(D80,2))","v":":::::"},{"$f":"UPPER(E80)","v":""},{"$f":"IF(LEFT(W80,1)=\"D\",LEFT(W80,3),\"XXX\")","v":"XXX"},{"$f":"CONCATENATE(W80,(LEFT(J80,1)))","v":""},{"$f":"IF(COUNTIF($W$6:$W80,$W80)=1,1,0)","v":0}]
[null,75,"",":::","",null,null,null,"",null,null,"","","",null,0,null,{"$f":"IF(COUNTIF($X$6:$X81,X81)=1,1,0)","v":0},0,{"$f":"IF(COUNTIF($Y$7:$Y81,Y81)=1,1,0)","v":0},"",":::::","","XXX","",{"$f":"IF(COUNTIF($W$6:$W81,$W81)=1,1,0)","v":0}]
[null,76,"",":::","",null,null,null,"",null,null,"","","",null,0,null,{"$f":"IF(COUNTIF($X$6:$X82,X82)=1,1,0)","v":0},0,{"$f":"IF(COUNTIF($Y$7:$Y82,Y82)=1,1,0)","v":0},"",":::::","","XXX","",{"$f":"IF(COUNTIF($W$6:$W82,$W82)=1,1,0)","v":0}]
[null,77,"",":::","",null,null,null,"",null,null,"","","",null,0,null,{"$f":"IF(COUNTIF($X$6:$X83,X83)=1,1,0)","v":0},0,{"$f":"IF(COUNTIF($Y$7:$Y83,Y83)=1,1,0)","v":0},"",":::::","","XXX","",{"$f":"IF(COUNTIF($W$6:$W83,$W83)=1,1,0)","v":0}]
[null,78,"",":::","",null,null,null,"",null,null,"","","",null,0,null,{"$f":"IF(COUNTIF($X$6:$X84,X84)=1,1,0)","v":0},0,{"$f":"IF(COUNTIF($Y$7:$Y84,Y84)=1,1,0)","v":0},"",":::::","","XXX","",{"$f":"IF(COUNTIF($W$6:$W84,$W84)=1,1,0)","v":0}]
[null,79,"",":::","",null,null,null,"",null,null,"","","",null,0,null,{"$f":"IF(COUNTIF($X$6:$X85,X85)=1,1,0)","v":0},0,{"$f":"IF(COUNTIF($Y$7:$Y85,Y85)=1,1,0)","v":0},"",":::::","","XXX","",{"$f":"IF(COUNTIF($W$6:$W85,$W85)=1,1,0)","v":0}]
[null,80,"",":::","",null,null,null,"",null,null,"","","",null,0,null,{"$f":"IF(COUNTIF($X$6:$X86,X86)=1,1,0)","v":0},0,{"$f":"IF(COUNTIF($Y$7:$Y86,Y86)=1,1,0)","v":0},"",":::::","","XXX","",{"$f":"IF(COUNTIF($W$6:$W86,$W86)=1,1,0)","v":0}]
[null,81,"",":::","",null,null,null,"",null,null,"","","",null,0,null,{"$f":"IF(COUNTIF($X$6:$X87,X87)=1,1,0)","v":0},0,{"$f":"IF(COUNTIF($Y$7:$Y87,Y87)=1,1,0)","v":0},"",":::::","","XXX","",{"$f":"IF(COUNTIF($W$6:$W87,$W87)=1,1,0)","v":0}]
[null,82,"",":::","",null,null,null,"",null,null,"","","",null,0,null,{"$f":"IF(COUNTIF($X$6:$X88,X88)=1,1,0)","v":0},0,{"$f":"IF(COUNTIF($Y$7:$Y88,Y88)=1,1,0)","v":0},"",":::::","","XXX","",{"$f":"IF(COUNTIF($W$6:$W88,$W88)=1,1,0)","v":0}]
[null,83,"",":::","",null,null,null,"",null,null,"","","",null,0,null,{"$f":"IF(COUNTIF($X$6:$X89,X89)=1,1,0)","v":0},0,{"$f":"IF(COUNTIF($Y$7:$Y89,Y89)=1,1,0)","v":0},"",":::::","","XXX","",{"$f":"IF(COUNTIF($W$6:$W89,$W89)=1,1,0)","v":0}]
[null,84,"",":::","",null,null,null,"",null,null,"","","",null,0,null,{"$f":"IF(COUNTIF($X$6:$X90,X90)=1,1,0)","v":0},0,{"$f":"IF(COUNTIF($Y$7:$Y90,Y90)=1,1,0)","v":0},"",":::::","","XXX","",{"$f":"IF(COUNTIF($W$6:$W90,$W90)=1,1,0)","v":0}]
[null,85,"",":::","",null,null,null,"",null,null,"","","",null,0,null,{"$f":"IF(COUNTIF($X$6:$X91,X91)=1,1,0)","v":0},0,{"$f":"IF(COUNTIF($Y$7:$Y91,Y91)=1,1,0)","v":0},"",":::::","","XXX","",{"$f":"IF(COUNTIF($W$6:$W91,$W91)=1,1,0)","v":0}]
[null,86,"",":::","",null,null,null,"",null,null,"","","",null,0,null,{"$f":"IF(COUNTIF($X$6:$X92,X92)=1,1,0)","v":0},0,{"$f":"IF(COUNTIF($Y$7:$Y92,Y92)=1,1,0)","v":0},"",":::::","","XXX","",{"$f":"IF(COUNTIF($W$6:$W92,$W92)=1,1,0)","v":0}]
[null,87,"",":::","",null,null,null,"",null,null,"","","",null,0,null,{"$f":"IF(COUNTIF($X$6:$X93,X93)=1,1,0)","v":0},0,{"$f":"IF(COUNTIF($Y$7:$Y93,Y93)=1,1,0)","v":0},"",":::::","","XXX","",{"$f":"IF(COUNTIF($W$6:$W93,$W93)=1,1,0)","v":0}]
[null,88,"",":::","",null,null,null,"",null,null,"","","",null,0,null,{"$f":"IF(COUNTIF($X$6:$X94,X94)=1,1,0)","v":0},0,{"$f":"IF(COUNTIF($Y$7:$Y94,Y94)=1,1,0)","v":0},"",":::::","","XXX","",{"$f":"IF(COUNTIF($W$6:$W94,$W94)=1,1,0)","v":0}]
[null,89,"",":::","",null,null,null,"",null,null,"","","",null,0,null,{"$f":"IF(COUNTIF($X$6:$X95,X95)=1,1,0)","v":0},0,{"$f":"IF(COUNTIF($Y$7:$Y95,Y95)=1,1,0)","v":0},"",":::::","","XXX","",{"$f":"IF(COUNTIF($W$6:$W95,$W95)=1,1,0)","v":0}]
[null,90,"",":::","",null,null,null,"",null,null,"","","",null,0,null,{"$f":"IF(COUNTIF($X$6:$X96,X96)=1,1,0)","v":0},0,{"$f":"IF(COUNTIF($Y$7:$Y96,Y96)=1,1,0)","v":0},"",":::::","","XXX","",{"$f":"IF(COUNTIF($W$6:$W96,$W96)=1,1,0)","v":0}]
[null,91,"",":::","",null,null,null,"",null,null,"","","",null,0,null,{"$f":"IF(COUNTIF($X$6:$X97,X97)=1,1,0)","v":0},0,{"$f":"IF(COUNTIF($Y$7:$Y97,Y97)=1,1,0)","v":0},"",":::::","","XXX","",{"$f":"IF(COUNTIF($W$6:$W97,$W97)=1,1,0)","v":0}]
[null,92,"",":::","",null,null,null,"",null,null,"","","",null,0,null,{"$f":"IF(COUNTIF($X$6:$X98,X98)=1,1,0)","v":0},0,{"$f":"IF(COUNTIF($Y$7:$Y98,Y98)=1,1,0)","v":0},"",":::::","","XXX","",{"$f":"IF(COUNTIF($W$6:$W98,$W98)=1,1,0)","v":0}]
[null,93,"",":::","",null,null,null,"",null,null,"","","",null,0,null,{"$f":"IF(COUNTIF($X$6:$X99,X99)=1,1,0)","v":0},0,{"$f":"IF(COUNTIF($Y$7:$Y99,Y99)=1,1,0)","v":0},"",":::::","","XXX","",{"$f":"IF(COUNTIF($W$6:$W99,$W99)=1,1,0)","v":0}]
[null,94,"",":::","",null,null,null,"",null,null,"","","",null,0,null,{"$f":"IF(COUNTIF($X$6:$X100,X100)=1,1,0)","v":0},0,{"$f":"IF(COUNTIF($Y$7:$Y100,Y100)=1,1,0)","v":0},"",":::::","","XXX","",{"$f":"IF(COUNTIF($W$6:$W100,$W100)=1,1,0)","v":0}]
[null,95,"",":::","",null,null,null,"",null,null,"","","",null,0,null,{"$f":"IF(COUNTIF($X$6:$X101,X101)=1,1,0)","v":0},0,{"$f":"IF(COUNTIF($Y$7:$Y101,Y101)=1,1,0)","v":0},"",":::::","","XXX","",{"$f":"IF(COUNTIF($W$6:$W101,$W101)=1,1,0)","v":0}]
[null,96,"",":::","",null,null,null,"",null,null,"","","",null,0,null,{"$f":"IF(COUNTIF($X$6:$X102,X102)=1,1,0)","v":0},0,{"$f":"IF(COUNTIF($Y$7:$Y102,Y102)=1,1,0)","v":0},"",":::::","","XXX","",{"$f":"IF(COUNTIF($W$6:$W102,$W102)=1,1,0)","v":0}]
[null,97,"",":::","",null,null,null,"",null,null,"","","",null,0,null,{"$f":"IF(COUNTIF($X$6:$X103,X103)=1,1,0)","v":0},0,{"$f":"IF(COUNTIF($Y$7:$Y103,Y103)=1,1,0)","v":0},"",":::::","","XXX","",{"$f":"IF(COUNTIF($W$6:$W103,$W103)=1,1,0)","v":0}]
[null,98,"",":::","",null,null,null,"",null,null,"","","",null,0,null,{"$f":"IF(COUNTIF($X$6:$X104,X104)=1,1,0)","v":0},0,{"$f":"IF(COUNTIF($Y$7:$Y104,Y104)=1,1,0)","v":0},"",":::::","","XXX","",{"$f":"IF(COUNTIF($W$6:$W104,$W104)=1,1,0)","v":0}]
[null,99,"",":::","",null,null,null,"",null,null,"","","",null,0,null,{"$f":"IF(COUNTIF($X$6:$X105,X105)=1,1,0)","v":0},0,{"$f":"IF(COUNTIF($Y$7:$Y105,Y105)=1,1,0)","v":0},"",":::::","","XXX","",{"$f":"IF(COUNTIF($W$6:$W105,$W105)=1,1,0)","v":0}]
[null,100,"",":::","",null,null,null,"",null,null,"","","",null,0,null,{"$f":"IF(COUNTIF($X$6:$X106,X106)=1,1,0)","v":0},0,{"$f":"IF(COUNTIF($Y$7:$Y106,Y106)=1,1,0)","v":0},"",":::::","","XXX","",{"$f":"IF(COUNTIF($W$6:$W106,$W106)=1,1,0)","v":0}]
[null,101,"",":::","",null,null,null,"",null,null,"","","",null,0,null,{"$f":"IF(COUNTIF($X$6:$X107,X107)=1,1,0)","v":0},0,{"$f":"IF(COUNTIF($Y$7:$Y107,Y107)=1,1,0)","v":0},"",":::::","","XXX","",{"$f":"IF(COUNTIF($W$6:$W107,$W107)=1,1,0)","v":0}]
[null,102,"",":::","",null,null,null,"",null,null,"","","",null,0,null,{"$f":"IF(COUNTIF($X$6:$X108,X108)=1,1,0)","v":0},0,{"$f":"IF(COUNTIF($Y$7:$Y108,Y108)=1,1,0)","v":0},"",":::::","","XXX","",{"$f":"IF(COUNTIF($W$6:$W108,$W108)=1,1,0)","v":0}]
[null,103,"",":::","",null,null,null,"",null,null,"","","",null,0,null,{"$f":"IF(COUNTIF($X$6:$X109,X109)=1,1,0)","v":0},0,{"$f":"IF(COUNTIF($Y$7:$Y109,Y109)=1,1,0)","v":0},"",":::::","","XXX","",{"$f":"IF(COUNTIF($W$6:$W109,$W109)=1,1,0)","v":0}]
[null,104,"",":::","",null,null,null,"",null,null,"","","",null,0,null,{"$f":"IF(COUNTIF($X$6:$X110,X110)=1,1,0)","v":0},0,{"$f":"IF(COUNTIF($Y$7:$Y110,Y110)=1,1,0)","v":0},"",":::::","","XXX","",{"$f":"IF(COUNTIF($W$6:$W110,$W110)=1,1,0)","v":0}]
[null,105,"",":::","",null,null,null,"",null,null,"","","",null,0,null,{"$f":"IF(COUNTIF($X$6:$X111,X111)=1,1,0)","v":0},0,{"$f":"IF(COUNTIF($Y$7:$Y111,Y111)=1,1,0)","v":0},"",":::::","","XXX","",{"$f":"IF(COUNTIF($W$6:$W111,$W111)=1,1,0)","v":0}]
[null,106,"",":::","",null,null,null,"",null,null,"","","",null,0,null,{"$f":"IF(COUNTIF($X$6:$X112,X112)=1,1,0)","v":0},0,{"$f":"IF(COUNTIF($Y$7:$Y112,Y112)=1,1,0)","v":0},"",":::::","","XXX","",{"$f":"IF(COUNTIF($W$6:$W112,$W112)=1,1,0)","v":0}]
[null,107,"",":::","",null,null,null,"",null,null,"","","",null,0,null,{"$f":"IF(COUNTIF($X$6:$X113,X113)=1,1,0)","v":0},0,{"$f":"IF(COUNTIF($Y$7:$Y113,Y113)=1,1,0)","v":0},"",":::::","","XXX","",{"$f":"IF(COUNTIF($W$6:$W113,$W113)=1,1,0)","v":0}]
[null,108,"",":::","",null,null,null,"",null,null,"","","",null,0,null,{"$f":"IF(COUNTIF($X$6:$X114,X114)=1,1,0)","v":0},0,{"$f":"IF(COUNTIF($Y$7:$Y114,Y114)=1,1,0)","v":0},"",":::::","","XXX","",{"$f":"IF(COUNTIF($W$6:$W114,$W114)=1,1,0)","v":0}]
[null,109,"",":::","",null,null,null,"",null,null,"","","",null,0,null,{"$f":"IF(COUNTIF($X$6:$X115,X115)=1,1,0)","v":0},0,{"$f":"IF(COUNTIF($Y$7:$Y115,Y115)=1,1,0)","v":0},"",":::::","","XXX","",{"$f":"IF(COUNTIF($W$6:$W115,$W115)=1,1,0)","v":0}]
[null,110,"",":::","",null,null,null,"",null,null,"","","",null,0,null,{"$f":"IF(COUNTIF($X$6:$X116,X116)=1,1,0)","v":0},0,{"$f":"IF(COUNTIF($Y$7:$Y116,Y116)=1,1,0)","v":0},"",":::::","","XXX","",{"$f":"IF(COUNTIF($W$6:$W116,$W116)=1,1,0)","v":0}]
[null,111,"",":::","",null,null,null,"",null,null,"","","",null,0,null,{"$f":"IF(COUNTIF($X$6:$X117,X117)=1,1,0)","v":0},0,{"$f":"IF(COUNTIF($Y$7:$Y117,Y117)=1,1,0)","v":0},"",":::::","","XXX","",{"$f":"IF(COUNTIF($W$6:$W117,$W117)=1,1,0)","v":0}]
[null,112,"",":::","",null,null,null,"",null,null,"","","",null,0,null,{"$f":"IF(COUNTIF($X$6:$X118,X118)=1,1,0)","v":0},0,{"$f":"IF(COUNTIF($Y$7:$Y118,Y118)=1,1,0)","v":0},"",":::::","","XXX","",{"$f":"IF(COUNTIF($W$6:$W118,$W118)=1,1,0)","v":0}]
[null,113,"",":::","",null,null,null,"",null,null,"","","",null,0,null,{"$f":"IF(COUNTIF($X$6:$X119,X119)=1,1,0)","v":0},0,{"$f":"IF(COUNTIF($Y$7:$Y119,Y119)=1,1,0)","v":0},"",":::::","","XXX","",{"$f":"IF(COUNTIF($W$6:$W119,$W119)=1,1,0)","v":0}]
[null,114,"",":::","",null,null,null,"",null,null,"","","",null,0,null,{"$f":"IF(COUNTIF($X$6:$X120,X120)=1,1,0)","v":0},0,{"$f":"IF(COUNTIF($Y$7:$Y120,Y120)=1,1,0)","v":0},"",":::::","","XXX","",{"$f":"IF(COUNTIF($W$6:$W120,$W120)=1,1,0)","v":0}]
[null,115,"",":::","",null,null,null,"",null,null,"","","",null,0,null,{"$f":"IF(COUNTIF($X$6:$X121,X121)=1,1,0)","v":0},0,{"$f":"IF(COUNTIF($Y$7:$Y121,Y121)=1,1,0)","v":0},"",":::::","","XXX","",{"$f":"IF(COUNTIF($W$6:$W121,$W121)=1,1,0)","v":0}]
[null,116,"",":::","",null,null,null,"",null,null,"","","",null,0,null,{"$f":"IF(COUNTIF($X$6:$X122,X122)=1,1,0)","v":0},0,{"$f":"IF(COUNTIF($Y$7:$Y122,Y122)=1,1,0)","v":0},"",":::::","","XXX","",{"$f":"IF(COUNTIF($W$6:$W122,$W122)=1,1,0)","v":0}]
[null,117,"",":::","",null,null,null,"",null,null,"","","",null,0,null,{"$f":"IF(COUNTIF($X$6:$X123,X123)=1,1,0)","v":0},0,{"$f":"IF(COUNTIF($Y$7:$Y123,Y123)=1,1,0)","v":0},"",":::::","","XXX","",{"$f":"IF(COUNTIF($W$6:$W123,$W123)=1,1,0)","v":0}]
[null,118,"",":::","",null,null,null,"",null,null,"","","",null,0,null,{"$f":"IF(COUNTIF($X$6:$X124,X124)=1,1,0)","v":0},0,{"$f":"IF(COUNTIF($Y$7:$Y124,Y124)=1,1,0)","v":0},"",":::::","","XXX","",{"$f":"IF(COUNTIF($W$6:$W124,$W124)=1,1,0)","v":0}]
[null,119,"",":::","",null,null,null,"",null,null,"","","",null,0,null,{"$f":"IF(COUNTIF($X$6:$X125,X125)=1,1,0)","v":0},0,{"$f":"IF(COUNTIF($Y$7:$Y125,Y125)=1,1,0)","v":0},"",":::::","","XXX","",{"$f":"IF(COUNTIF($W$6:$W125,$W125)=1,1,0)","v":0}]
[null,120,"",":::","",null,null,null,"",null,null,"","","",null,0,null,{"$f":"IF(COUNTIF($X$6:$X126,X126)=1,1,0)","v":0},0,{"$f":"IF(COUNTIF($Y$7:$Y126,Y126)=1,1,0)","v":0},"",":::::","","XXX","",{"$f":"IF(COUNTIF($W$6:$W126,$W126)=1,1,0)","v":0}]
[null,121,"",":::","",null,null,null,"",null,null,"","","",null,0,null,{"$f":"IF(COUNTIF($X$6:$X127,X127)=1,1,0)","v":0},0,{"$f":"IF(COUNTIF($Y$7:$Y127,Y127)=1,1,0)","v":0},"",":::::","","XXX","",{"$f":"IF(COUNTIF($W$6:$W127,$W127)=1,1,0)","v":0}]
[null,122,"",":::","",null,null,null,"",null,null,"","","",null,0,null,{"$f":"IF(COUNTIF($X$6:$X128,X128)=1,1,0)","v":0},0,{"$f":"IF(COUNTIF($Y$7:$Y128,Y128)=1,1,0)","v":0},"",":::::","","XXX","",{"$f":"IF(COUNTIF($W$6:$W128,$W128)=1,1,0)","v":0}]
[null,123,"",":::","",null,null,null,"",null,null,"","","",null,0,null,{"$f":"IF(COUNTIF($X$6:$X129,X129)=1,1,0)","v":0},0,{"$f":"IF(COUNTIF($Y$7:$Y129,Y129)=1,1,0)","v":0},"",":::::","","XXX","",{"$f":"IF(COUNTIF($W$6:$W129,$W129)=1,1,0)","v":0}]
[null,124,"",":::","",null,null,null,"",null,null,"","","",null,0,null,{"$f":"IF(COUNTIF($X$6:$X130,X130)=1,1,0)","v":0},0,{"$f":"IF(COUNTIF($Y$7:$Y130,Y130)=1,1,0)","v":0},"",":::::","","XXX","",{"$f":"IF(COUNTIF($W$6:$W130,$W130)=1,1,0)","v":0}]
[null,125,"",":::","",null,null,null,"",null,null,"","","",null,0,null,{"$f":"IF(COUNTIF($X$6:$X131,X131)=1,1,0)","v":0},0,{"$f":"IF(COUNTIF($Y$7:$Y131,Y131)=1,1,0)","v":0},"",":::::","","XXX","",{"$f":"IF(COUNTIF($W$6:$W131,$W131)=1,1,0)","v":0}]
[null,126,"",":::","",null,null,null,"",null,null,"","","",null,0,null,{"$f":"IF(COUNTIF($X$6:$X132,X132)=1,1,0)","v":0},0,{"$f":"IF(COUNTIF($Y$7:$Y132,Y132)=1,1,0)","v":0},"",":::::","","XXX","",{"$f":"IF(COUNTIF($W$6:$W132,$W132)=1,1,0)","v":0}]
[null,127,"",":::","",null,null,null,"",null,null,"","","",null,0,null,{"$f":"IF(COUNTIF($X$6:$X133,X133)=1,1,0)","v":0},0,{"$f":"IF(COUNTIF($Y$7:$Y133,Y133)=1,1,0)","v":0},"",":::::","","XXX","",{"$f":"IF(COUNTIF($W$6:$W133,$W133)=1,1,0)","v":0}]
[null,128,"",":::","",null,null,null,"",null,null,"","","",null,0,null,{"$f":"IF(COUNTIF($X$6:$X134,X134)=1,1,0)","v":0},0,{"$f":"IF(COUNTIF($Y$7:$Y134,Y134)=1,1,0)","v":0},"",":::::","","XXX","",{"$f":"IF(COUNTIF($W$6:$W134,$W134)=1,1,0)","v":0}]
[null,129,{"$f":"IF(F135>0,date1,\"\")","v":""},":::","",null,null,null,"",null,null,"","","",null,0,null,{"$f":"IF(COUNTIF($X$6:$X135,X135)=1,1,0)","v":0},0,{"$f":"IF(COUNTIF($Y$7:$Y135,Y135)=1,1,0)","v":0},"",":::::","","XXX","",{"$f":"IF(COUNTIF($W$6:$W135,$W135)=1,1,0)","v":0}]
[null,130,"",":::","",null,null,null,"",null,null,"","","",null,{"$f":"IF(F136>0,1,0)","v":0},null,{"$f":"IF(COUNTIF($X$6:$X136,X136)=1,1,0)","v":0},0,{"$f":"IF(COUNTIF($Y$7:$Y136,Y136)=1,1,0)","v":0},"",":::::","","XXX","",{"$f":"IF(COUNTIF($W$6:$W136,$W136)=1,1,0)","v":0}]
[null,131,"",":::","",null,null,null,"",null,null,"","","",null,0,null,{"$f":"IF(COUNTIF($X$6:$X137,X137)=1,1,0)","v":0},0,{"$f":"IF(COUNTIF($Y$7:$Y137,Y137)=1,1,0)","v":0},"",":::::","","XXX","",{"$f":"IF(COUNTIF($W$6:$W137,$W137)=1,1,0)","v":0}]
[null,132,"",":::","",null,null,null,"",null,null,"","","",null,0,null,{"$f":"IF(COUNTIF($X$6:$X138,X138)=1,1,0)","v":0},0,{"$f":"IF(COUNTIF($Y$7:$Y138,Y138)=1,1,0)","v":0},"",":::::","","XXX","",{"$f":"IF(COUNTIF($W$6:$W138,$W138)=1,1,0)","v":0}]
[null,133,"",":::","",null,null,null,"",null,null,"","","",null,0,null,{"$f":"IF(COUNTIF($X$6:$X139,X139)=1,1,0)","v":0},0,{"$f":"IF(COUNTIF($Y$7:$Y139,Y139)=1,1,0)","v":0},"",":::::","","XXX","",{"$f":"IF(COUNTIF($W$6:$W139,$W139)=1,1,0)","v":0}]
[null,134,"",":::","",null,null,null,"",null,null,"","","",null,0,null,{"$f":"IF(COUNTIF($X$6:$X140,X140)=1,1,0)","v":0},0,{"$f":"IF(COUNTIF($Y$7:$Y140,Y140)=1,1,0)","v":0},"",":::::","","XXX","",{"$f":"IF(COUNTIF($W$6:$W140,$W140)=1,1,0)","v":0}]
[null,135,"",":::","",null,null,null,"",null,null,"","","",null,0,null,{"$f":"IF(COUNTIF($X$6:$X141,X141)=1,1,0)","v":0},0,{"$f":"IF(COUNTIF($Y$7:$Y141,Y141)=1,1,0)","v":0},"",":::::","","XXX","",{"$f":"IF(COUNTIF($W$6:$W141,$W141)=1,1,0)","v":0}]
[null,136,"",":::","",null,null,null,"",null,null,"","","",null,0,null,{"$f":"IF(COUNTIF($X$6:$X142,X142)=1,1,0)","v":0},0,{"$f":"IF(COUNTIF($Y$7:$Y142,Y142)=1,1,0)","v":0},"",":::::","","XXX","",{"$f":"IF(COUNTIF($W$6:$W142,$W142)=1,1,0)","v":0}]
[null,137,"",":::","",null,null,null,"",null,null,"","","",null,0,null,{"$f":"IF(COUNTIF($X$6:$X143,X143)=1,1,0)","v":0},0,{"$f":"IF(COUNTIF($Y$7:$Y143,Y143)=1,1,0)","v":0},"",":::::","","XXX","",{"$f":"IF(COUNTIF($W$6:$W143,$W143)=1,1,0)","v":0}]
[null,138,"",":::","",null,null,null,"",null,null,{"$f":"IF(E144=\"\",\"\",IF(T144=1,1,0))","v":""},{"$f":"IF(E144=\"\",\"\",R144+S144)","v":""},{"$f":"IF(E144=\"\",\"\",IF(T144=0,\"doppeltes Call\",\"\"))","v":""},null,0,null,{"$f":"IF(COUNTIF($X$6:$X144,X144)=1,1,0)","v":0},{"$f":"IF(COUNTIF(SSTN,W144)=1,IF(Z144=0,0,1),0)","v":0},{"$f":"IF(COUNTIF($Y$7:$Y144,Y144)=1,1,0)","v":0},{"$f":"UPPER(SUBSTITUTE(I144,\" \",\"\",1))","v":""},{"$f":"CONCATENATE(LEFT(D144,2),\":\",RIGHT(D144,2))","v":":::::"},{"$f":"UPPER(E144)","v":""},{"$f":"IF(LEFT(W144,1)=\"D\",LEFT(W144,3),\"XXX\")","v":"XXX"},{"$f":"CONCATENATE(W144,(LEFT(J144,1)))","v":""},{"$f":"IF(COUNTIF($W$6:$W144,$W144)=1,1,0)","v":0}]
[null,139,"",":::","",null,null,null,"",null,null,"","","",null,0,null,{"$f":"IF(COUNTIF($X$6:$X145,X145)=1,1,0)","v":0},0,{"$f":"IF(COUNTIF($Y$7:$Y145,Y145)=1,1,0)","v":0},"",":::::","","XXX","",{"$f":"IF(COUNTIF($W$6:$W145,$W145)=1,1,0)","v":0}]
[null,140,"",":::","",null,null,null,"",null,null,"","","",null,0,null,{"$f":"IF(COUNTIF($X$6:$X146,X146)=1,1,0)","v":0},0,{"$f":"IF(COUNTIF($Y$7:$Y146,Y146)=1,1,0)","v":0},"",":::::","","XXX","",{"$f":"IF(COUNTIF($W$6:$W146,$W146)=1,1,0)","v":0}]
[null,141,"",":::","",null,null,null,"",null,null,"","","",null,0,null,{"$f":"IF(COUNTIF($X$6:$X147,X147)=1,1,0)","v":0},0,{"$f":"IF(COUNTIF($Y$7:$Y147,Y147)=1,1,0)","v":0},"",":::::","","XXX","",{"$f":"IF(COUNTIF($W$6:$W147,$W147)=1,1,0)","v":0}]
[null,142,"",":::","",null,null,null,"",null,null,"","","",null,0,null,{"$f":"IF(COUNTIF($X$6:$X148,X148)=1,1,0)","v":0},0,{"$f":"IF(COUNTIF($Y$7:$Y148,Y148)=1,1,0)","v":0},"",":::::","","XXX","",{"$f":"IF(COUNTIF($W$6:$W148,$W148)=1,1,0)","v":0}]
[null,143,"",":::","",null,null,null,"",null,null,"","","",null,0,null,{"$f":"IF(COUNTIF($X$6:$X149,X149)=1,1,0)","v":0},0,{"$f":"IF(COUNTIF($Y$7:$Y149,Y149)=1,1,0)","v":0},"",":::::","","XXX","",{"$f":"IF(COUNTIF($W$6:$W149,$W149)=1,1,0)","v":0}]
[null,144,"",":::","",null,null,null,"",null,null,"","","",null,0,null,{"$f":"IF(COUNTIF($X$6:$X150,X150)=1,1,0)","v":0},0,{"$f":"IF(COUNTIF($Y$7:$Y150,Y150)=1,1,0)","v":0},"",":::::","","XXX","",{"$f":"IF(COUNTIF($W$6:$W150,$W150)=1,1,0)","v":0}]
[null,145,"",":::","",null,null,null,"",null,null,"","","",null,0,null,{"$f":"IF(COUNTIF($X$6:$X151,X151)=1,1,0)","v":0},0,{"$f":"IF(COUNTIF($Y$7:$Y151,Y151)=1,1,0)","v":0},"",":::::","","XXX","",{"$f":"IF(COUNTIF($W$6:$W151,$W151)=1,1,0)","v":0}]
[null,146,"",":::","",null,null,null,"",null,null,"","","",null,0,null,{"$f":"IF(COUNTIF($X$6:$X152,X152)=1,1,0)","v":0},0,{"$f":"IF(COUNTIF($Y$7:$Y152,Y152)=1,1,0)","v":0},"",":::::","","XXX","",{"$f":"IF(COUNTIF($W$6:$W152,$W152)=1,1,0)","v":0}]
[null,147,"",":::","",null,null,null,"",null,null,"","","",null,0,null,{"$f":"IF(COUNTIF($X$6:$X153,X153)=1,1,0)","v":0},0,{"$f":"IF(COUNTIF($Y$7:$Y153,Y153)=1,1,0)","v":0},"",":::::","","XXX","",{"$f":"IF(COUNTIF($W$6:$W153,$W153)=1,1,0)","v":0}]
[null,148,"",":::","",null,null,null,"",null,null,"","","",null,0,null,{"$f":"IF(COUNTIF($X$6:$X154,X154)=1,1,0)","v":0},0,{"$f":"IF(COUNTIF($Y$7:$Y154,Y154)=1,1,0)","v":0},"",":::::","","XXX","",{"$f":"IF(COUNTIF($W$6:$W154,$W154)=1,1,0)","v":0}]
[null,149,"",":::","",null,null,null,"",null,null,"","","",null,0,null,{"$f":"IF(COUNTIF($X$6:$X155,X155)=1,1,0)","v":0},0,{"$f":"IF(COUNTIF($Y$7:$Y155,Y155)=1,1,0)","v":0},"",":::::","","XXX","",{"$f":"IF(COUNTIF($W$6:$W155,$W155)=1,1,0)","v":0}]
[null,150,"",":::","",null,null,null,"",null,null,"","","",null,0,null,{"$f":"IF(COUNTIF($X$6:$X156,X156)=1,1,0)","v":0},0,{"$f":"IF(COUNTIF($Y$7:$Y156,Y156)=1,1,0)","v":0},"",":::::","","XXX","",{"$f":"IF(COUNTIF($W$6:$W156,$W156)=1,1,0)","v":0}]
[null,151,"",":::","",null,null,null,"",null,null,"","","",null,0,null,{"$f":"IF(COUNTIF($X$6:$X157,X157)=1,1,0)","v":0},0,{"$f":"IF(COUNTIF($Y$7:$Y157,Y157)=1,1,0)","v":0},"",":::::","","XXX","",{"$f":"IF(COUNTIF($W$6:$W157,$W157)=1,1,0)","v":0}]
[null,152,"",":::","",null,null,null,"",null,null,"","","",null,0,null,{"$f":"IF(COUNTIF($X$6:$X158,X158)=1,1,0)","v":0},0,{"$f":"IF(COUNTIF($Y$7:$Y158,Y158)=1,1,0)","v":0},"",":::::","","XXX","",{"$f":"IF(COUNTIF($W$6:$W158,$W158)=1,1,0)","v":0}]
[null,153,"",":::","",null,null,null,"",null,null,"","","",null,0,null,{"$f":"IF(COUNTIF($X$6:$X159,X159)=1,1,0)","v":0},0,{"$f":"IF(COUNTIF($Y$7:$Y159,Y159)=1,1,0)","v":0},"",":::::","","XXX","",{"$f":"IF(COUNTIF($W$6:$W159,$W159)=1,1,0)","v":0}]
[null,154,"",":::","",null,null,null,"",null,null,"","","",null,0,null,{"$f":"IF(COUNTIF($X$6:$X160,X160)=1,1,0)","v":0},0,{"$f":"IF(COUNTIF($Y$7:$Y160,Y160)=1,1,0)","v":0},"",":::::","","XXX","",{"$f":"IF(COUNTIF($W$6:$W160,$W160)=1,1,0)","v":0}]
[null,155,"",":::","",null,null,null,"",null,null,"","","",null,0,null,{"$f":"IF(COUNTIF($X$6:$X161,X161)=1,1,0)","v":0},0,{"$f":"IF(COUNTIF($Y$7:$Y161,Y161)=1,1,0)","v":0},"",":::::","","XXX","",{"$f":"IF(COUNTIF($W$6:$W161,$W161)=1,1,0)","v":0}]
[null,156,"",":::","",null,null,null,"",null,null,"","","",null,0,null,{"$f":"IF(COUNTIF($X$6:$X162,X162)=1,1,0)","v":0},0,{"$f":"IF(COUNTIF($Y$7:$Y162,Y162)=1,1,0)","v":0},"",":::::","","XXX","",{"$f":"IF(COUNTIF($W$6:$W162,$W162)=1,1,0)","v":0}]
[null,157,"",":::","",null,null,null,"",null,null,"","","",null,0,null,{"$f":"IF(COUNTIF($X$6:$X163,X163)=1,1,0)","v":0},0,{"$f":"IF(COUNTIF($Y$7:$Y163,Y163)=1,1,0)","v":0},"",":::::","","XXX","",{"$f":"IF(COUNTIF($W$6:$W163,$W163)=1,1,0)","v":0}]
[null,158,"",":::","",null,null,null,"",null,null,"","","",null,0,null,{"$f":"IF(COUNTIF($X$6:$X164,X164)=1,1,0)","v":0},0,{"$f":"IF(COUNTIF($Y$7:$Y164,Y164)=1,1,0)","v":0},"",":::::","","XXX","",{"$f":"IF(COUNTIF($W$6:$W164,$W164)=1,1,0)","v":0}]
[null,159,"",":::","",null,null,null,"",null,null,"","","",null,0,null,{"$f":"IF(COUNTIF($X$6:$X165,X165)=1,1,0)","v":0},0,{"$f":"IF(COUNTIF($Y$7:$Y165,Y165)=1,1,0)","v":0},"",":::::","","XXX","",{"$f":"IF(COUNTIF($W$6:$W165,$W165)=1,1,0)","v":0}]
[null,160,"",":::","",null,null,null,"",null,null,"","","",null,0,null,{"$f":"IF(COUNTIF($X$6:$X166,X166)=1,1,0)","v":0},0,{"$f":"IF(COUNTIF($Y$7:$Y166,Y166)=1,1,0)","v":0},"",":::::","","XXX","",{"$f":"IF(COUNTIF($W$6:$W166,$W166)=1,1,0)","v":0}]
[null,161,"",":::","",null,null,null,"",null,null,"","","",null,0,null,{"$f":"IF(COUNTIF($X$6:$X167,X167)=1,1,0)","v":0},0,{"$f":"IF(COUNTIF($Y$7:$Y167,Y167)=1,1,0)","v":0},"",":::::","","XXX","",{"$f":"IF(COUNTIF($W$6:$W167,$W167)=1,1,0)","v":0}]
[null,162,"",":::","",null,null,null,"",null,null,"","","",null,0,null,{"$f":"IF(COUNTIF($X$6:$X168,X168)=1,1,0)","v":0},0,{"$f":"IF(COUNTIF($Y$7:$Y168,Y168)=1,1,0)","v":0},"",":::::","","XXX","",{"$f":"IF(COUNTIF($W$6:$W168,$W168)=1,1,0)","v":0}]
[null,163,"",":::","",null,null,null,"",null,null,"","","",null,0,null,{"$f":"IF(COUNTIF($X$6:$X169,X169)=1,1,0)","v":0},0,{"$f":"IF(COUNTIF($Y$7:$Y169,Y169)=1,1,0)","v":0},"",":::::","","XXX","",{"$f":"IF(COUNTIF($W$6:$W169,$W169)=1,1,0)","v":0}]
[null,164,"",":::","",null,null,null,"",null,null,"","","",null,0,null,{"$f":"IF(COUNTIF($X$6:$X170,X170)=1,1,0)","v":0},0,{"$f":"IF(COUNTIF($Y$7:$Y170,Y170)=1,1,0)","v":0},"",":::::","","XXX","",{"$f":"IF(COUNTIF($W$6:$W170,$W170)=1,1,0)","v":0}]
[null,165,"",":::","",null,null,null,"",null,null,"","","",null,0,null,{"$f":"IF(COUNTIF($X$6:$X171,X171)=1,1,0)","v":0},0,{"$f":"IF(COUNTIF($Y$7:$Y171,Y171)=1,1,0)","v":0},"",":::::","","XXX","",{"$f":"IF(COUNTIF($W$6:$W171,$W171)=1,1,0)","v":0}]
[null,166,"",":::","",null,null,null,"",null,null,"","","",null,0,null,{"$f":"IF(COUNTIF($X$6:$X172,X172)=1,1,0)","v":0},0,{"$f":"IF(COUNTIF($Y$7:$Y172,Y172)=1,1,0)","v":0},"",":::::","","XXX","",{"$f":"IF(COUNTIF($W$6:$W172,$W172)=1,1,0)","v":0}]
[null,167,"",":::","",null,null,null,"",null,null,"","","",null,0,null,{"$f":"IF(COUNTIF($X$6:$X173,X173)=1,1,0)","v":0},0,{"$f":"IF(COUNTIF($Y$7:$Y173,Y173)=1,1,0)","v":0},"",":::::","","XXX","",{"$f":"IF(COUNTIF($W$6:$W173,$W173)=1,1,0)","v":0}]
[null,168,"",":::","",null,null,null,"",null,null,"","","",null,0,null,{"$f":"IF(COUNTIF($X$6:$X174,X174)=1,1,0)","v":0},0,{"$f":"IF(COUNTIF($Y$7:$Y174,Y174)=1,1,0)","v":0},"",":::::","","XXX","",{"$f":"IF(COUNTIF($W$6:$W174,$W174)=1,1,0)","v":0}]
[null,169,"",":::","",null,null,null,"",null,null,"","","",null,0,null,{"$f":"IF(COUNTIF($X$6:$X175,X175)=1,1,0)","v":0},0,{"$f":"IF(COUNTIF($Y$7:$Y175,Y175)=1,1,0)","v":0},"",":::::","","XXX","",{"$f":"IF(COUNTIF($W$6:$W175,$W175)=1,1,0)","v":0}]
[null,170,"",":::","",null,null,null,"",null,null,"","","",null,0,null,{"$f":"IF(COUNTIF($X$6:$X176,X176)=1,1,0)","v":0},0,{"$f":"IF(COUNTIF($Y$7:$Y176,Y176)=1,1,0)","v":0},"",":::::","","XXX","",{"$f":"IF(COUNTIF($W$6:$W176,$W176)=1,1,0)","v":0}]
[null,171,"",":::","",null,null,null,"",null,null,"","","",null,0,null,{"$f":"IF(COUNTIF($X$6:$X177,X177)=1,1,0)","v":0},0,{"$f":"IF(COUNTIF($Y$7:$Y177,Y177)=1,1,0)","v":0},"",":::::","","XXX","",{"$f":"IF(COUNTIF($W$6:$W177,$W177)=1,1,0)","v":0}]
[null,172,"",":::","",null,null,null,"",null,null,"","","",null,0,null,{"$f":"IF(COUNTIF($X$6:$X178,X178)=1,1,0)","v":0},0,{"$f":"IF(COUNTIF($Y$7:$Y178,Y178)=1,1,0)","v":0},"",":::::","","XXX","",{"$f":"IF(COUNTIF($W$6:$W178,$W178)=1,1,0)","v":0}]
[null,173,"",":::","",null,null,null,"",null,null,"","","",null,0,null,{"$f":"IF(COUNTIF($X$6:$X179,X179)=1,1,0)","v":0},0,{"$f":"IF(COUNTIF($Y$7:$Y179,Y179)=1,1,0)","v":0},"",":::::","","XXX","",{"$f":"IF(COUNTIF($W$6:$W179,$W179)=1,1,0)","v":0}]
[null,174,"",":::","",null,null,null,"",null,null,"","","",null,0,null,{"$f":"IF(COUNTIF($X$6:$X180,X180)=1,1,0)","v":0},0,{"$f":"IF(COUNTIF($Y$7:$Y180,Y180)=1,1,0)","v":0},"",":::::","","XXX","",{"$f":"IF(COUNTIF($W$6:$W180,$W180)=1,1,0)","v":0}]
[null,175,"",":::","",null,null,null,"",null,null,"","","",null,0,null,{"$f":"IF(COUNTIF($X$6:$X181,X181)=1,1,0)","v":0},0,{"$f":"IF(COUNTIF($Y$7:$Y181,Y181)=1,1,0)","v":0},"",":::::","","XXX","",{"$f":"IF(COUNTIF($W$6:$W181,$W181)=1,1,0)","v":0}]
[null,176,"",":::","",null,null,null,"",null,null,"","","",null,0,null,{"$f":"IF(COUNTIF($X$6:$X182,X182)=1,1,0)","v":0},0,{"$f":"IF(COUNTIF($Y$7:$Y182,Y182)=1,1,0)","v":0},"",":::::","","XXX","",{"$f":"IF(COUNTIF($W$6:$W182,$W182)=1,1,0)","v":0}]
[null,177,"",":::","",null,null,null,"",null,null,"","","",null,0,null,{"$f":"IF(COUNTIF($X$6:$X183,X183)=1,1,0)","v":0},0,{"$f":"IF(COUNTIF($Y$7:$Y183,Y183)=1,1,0)","v":0},"",":::::","","XXX","",{"$f":"IF(COUNTIF($W$6:$W183,$W183)=1,1,0)","v":0}]
[null,178,"",":::","",null,null,null,"",null,null,"","","",null,0,null,{"$f":"IF(COUNTIF($X$6:$X184,X184)=1,1,0)","v":0},0,{"$f":"IF(COUNTIF($Y$7:$Y184,Y184)=1,1,0)","v":0},"",":::::","","XXX","",{"$f":"IF(COUNTIF($W$6:$W184,$W184)=1,1,0)","v":0}]
[null,179,"",":::","",null,null,null,"",null,null,"","","",null,0,null,{"$f":"IF(COUNTIF($X$6:$X185,X185)=1,1,0)","v":0},0,{"$f":"IF(COUNTIF($Y$7:$Y185,Y185)=1,1,0)","v":0},"",":::::","","XXX","",{"$f":"IF(COUNTIF($W$6:$W185,$W185)=1,1,0)","v":0}]
[null,180,"",":::","",null,null,null,"",null,null,"","","",null,0,null,{"$f":"IF(COUNTIF($X$6:$X186,X186)=1,1,0)","v":0},0,{"$f":"IF(COUNTIF($Y$7:$Y186,Y186)=1,1,0)","v":0},"",":::::","","XXX","",{"$f":"IF(COUNTIF($W$6:$W186,$W186)=1,1,0)","v":0}]
[null,181,"",":::","",null,null,null,"",null,null,"","","",null,0,null,{"$f":"IF(COUNTIF($X$6:$X187,X187)=1,1,0)","v":0},0,{"$f":"IF(COUNTIF($Y$7:$Y187,Y187)=1,1,0)","v":0},"",":::::","","XXX","",{"$f":"IF(COUNTIF($W$6:$W187,$W187)=1,1,0)","v":0}]
[null,182,"",":::","",null,null,null,"",null,null,"","","",null,0,null,{"$f":"IF(COUNTIF($X$6:$X188,X188)=1,1,0)","v":0},0,{"$f":"IF(COUNTIF($Y$7:$Y188,Y188)=1,1,0)","v":0},"",":::::","","XXX","",{"$f":"IF(COUNTIF($W$6:$W188,$W188)=1,1,0)","v":0}]
[null,183,"",":::","",null,null,null,"",null,null,"","","",null,0,null,{"$f":"IF(COUNTIF($X$6:$X189,X189)=1,1,0)","v":0},0,{"$f":"IF(COUNTIF($Y$7:$Y189,Y189)=1,1,0)","v":0},"",":::::","","XXX","",{"$f":"IF(COUNTIF($W$6:$W189,$W189)=1,1,0)","v":0}]
[null,184,"",":::","",null,null,null,"",null,null,"","","",null,0,null,{"$f":"IF(COUNTIF($X$6:$X190,X190)=1,1,0)","v":0},0,{"$f":"IF(COUNTIF($Y$7:$Y190,Y190)=1,1,0)","v":0},"",":::::","","XXX","",{"$f":"IF(COUNTIF($W$6:$W190,$W190)=1,1,0)","v":0}]
[null,185,"",":::","",null,null,null,"",null,null,"","","",null,0,null,{"$f":"IF(COUNTIF($X$6:$X191,X191)=1,1,0)","v":0},0,{"$f":"IF(COUNTIF($Y$7:$Y191,Y191)=1,1,0)","v":0},"",":::::","","XXX","",{"$f":"IF(COUNTIF($W$6:$W191,$W191)=1,1,0)","v":0}]
[null,186,"",":::","",null,null,null,"",null,null,"","","",null,0,null,{"$f":"IF(COUNTIF($X$6:$X192,X192)=1,1,0)","v":0},0,{"$f":"IF(COUNTIF($Y$7:$Y192,Y192)=1,1,0)","v":0},"",":::::","","XXX","",{"$f":"IF(COUNTIF($W$6:$W192,$W192)=1,1,0)","v":0}]
[null,187,"",":::","",null,null,null,"",null,null,"","","",null,0,null,{"$f":"IF(COUNTIF($X$6:$X193,X193)=1,1,0)","v":0},0,{"$f":"IF(COUNTIF($Y$7:$Y193,Y193)=1,1,0)","v":0},"",":::::","","XXX","",{"$f":"IF(COUNTIF($W$6:$W193,$W193)=1,1,0)","v":0}]
[null,188,"",":::","",null,null,null,"",null,null,"","","",null,0,null,{"$f":"IF(COUNTIF($X$6:$X194,X194)=1,1,0)","v":0},0,{"$f":"IF(COUNTIF($Y$7:$Y194,Y194)=1,1,0)","v":0},"",":::::","","XXX","",{"$f":"IF(COUNTIF($W$6:$W194,$W194)=1,1,0)","v":0}]
[null,189,"",":::","",null,null,null,"",null,null,"","","",null,0,null,{"$f":"IF(COUNTIF($X$6:$X195,X195)=1,1,0)","v":0},0,{"$f":"IF(COUNTIF($Y$7:$Y195,Y195)=1,1,0)","v":0},"",":::::","","XXX","",{"$f":"IF(COUNTIF($W$6:$W195,$W195)=1,1,0)","v":0}]
[null,190,"",":::","",null,null,null,"",null,null,"","","",null,0,null,{"$f":"IF(COUNTIF($X$6:$X196,X196)=1,1,0)","v":0},0,{"$f":"IF(COUNTIF($Y$7:$Y196,Y196)=1,1,0)","v":0},"",":::::","","XXX","",{"$f":"IF(COUNTIF($W$6:$W196,$W196)=1,1,0)","v":0}]
[null,191,"",":::","",null,null,null,"",null,null,"","","",null,0,null,{"$f":"IF(COUNTIF($X$6:$X197,X197)=1,1,0)","v":0},0,{"$f":"IF(COUNTIF($Y$7:$Y197,Y197)=1,1,0)","v":0},"",":::::","","XXX","",{"$f":"IF(COUNTIF($W$6:$W197,$W197)=1,1,0)","v":0}]
[null,192,"",":::","",null,null,null,"",null,null,"","","",null,0,null,{"$f":"IF(COUNTIF($X$6:$X198,X198)=1,1,0)","v":0},0,{"$f":"IF(COUNTIF($Y$7:$Y198,Y198)=1,1,0)","v":0},"",":::::","","XXX","",{"$f":"IF(COUNTIF($W$6:$W198,$W198)=1,1,0)","v":0}]
[null,193,{"$f":"IF(F199>0,date1,\"\")","v":""},":::","",null,null,null,"",null,null,"","","",null,0,null,{"$f":"IF(COUNTIF($X$6:$X199,X199)=1,1,0)","v":0},0,{"$f":"IF(COUNTIF($Y$7:$Y199,Y199)=1,1,0)","v":0},"",":::::","","XXX","",{"$f":"IF(COUNTIF($W$6:$W199,$W199)=1,1,0)","v":0}]
[null,194,"",":::","",null,null,null,"",null,null,"","","",null,{"$f":"IF(F200>0,1,0)","v":0},null,{"$f":"IF(COUNTIF($X$6:$X200,X200)=1,1,0)","v":0},0,{"$f":"IF(COUNTIF($Y$7:$Y200,Y200)=1,1,0)","v":0},"",":::::","","XXX","",{"$f":"IF(COUNTIF($W$6:$W200,$W200)=1,1,0)","v":0}]
[null,195,"",":::","",null,null,null,"",null,null,"","","",null,0,null,{"$f":"IF(COUNTIF($X$6:$X201,X201)=1,1,0)","v":0},0,{"$f":"IF(COUNTIF($Y$7:$Y201,Y201)=1,1,0)","v":0},"",":::::","","XXX","",{"$f":"IF(COUNTIF($W$6:$W201,$W201)=1,1,0)","v":0}]
[null,196,"",":::","",null,null,null,"",null,null,"","","",null,0,null,{"$f":"IF(COUNTIF($X$6:$X202,X202)=1,1,0)","v":0},0,{"$f":"IF(COUNTIF($Y$7:$Y202,Y202)=1,1,0)","v":0},"",":::::","","XXX","",{"$f":"IF(COUNTIF($W$6:$W202,$W202)=1,1,0)","v":0}]
[null,197,"",":::","",null,null,null,"",null,null,"","","",null,0,null,{"$f":"IF(COUNTIF($X$6:$X203,X203)=1,1,0)","v":0},0,{"$f":"IF(COUNTIF($Y$7:$Y203,Y203)=1,1,0)","v":0},"",":::::","","XXX","",{"$f":"IF(COUNTIF($W$6:$W203,$W203)=1,1,0)","v":0}]
[null,198,"",":::","",null,null,null,"",null,null,"","","",null,0,null,{"$f":"IF(COUNTIF($X$6:$X204,X204)=1,1,0)","v":0},0,{"$f":"IF(COUNTIF($Y$7:$Y204,Y204)=1,1,0)","v":0},"",":::::","","XXX","",{"$f":"IF(COUNTIF($W$6:$W204,$W204)=1,1,0)","v":0}]
[null,199,"",":::","",null,null,null,"",null,null,"","","",null,0,null,{"$f":"IF(COUNTIF($X$6:$X205,X205)=1,1,0)","v":0},0,{"$f":"IF(COUNTIF($Y$7:$Y205,Y205)=1,1,0)","v":0},"",":::::","","XXX","",{"$f":"IF(COUNTIF($W$6:$W205,$W205)=1,1,0)","v":0}]
[null,200,"",":::","",null,null,null,"",null,null,"","","",null,0,null,{"$f":"IF(COUNTIF($X$6:$X206,X206)=1,1,0)","v":0},0,{"$f":"IF(COUNTIF($Y$7:$Y206,Y206)=1,1,0)","v":0},"",":::::","","XXX","",{"$f":"IF(COUNTIF($W$6:$W206,$W206)=1,1,0)","v":0}]
[null,201,"",":::","",null,null,null,"",null,null,"","","",null,0,null,{"$f":"IF(COUNTIF($X$6:$X207,X207)=1,1,0)","v":0},0,{"$f":"IF(COUNTIF($Y$7:$Y207,Y207)=1,1,0)","v":0},"",":::::","","XXX","",{"$f":"IF(COUNTIF($W$6:$W207,$W207)=1,1,0)","v":0}]
[null,202,"",":::","",null,null,null,"",null,null,{"$f":"IF(E208=\"\",\"\",IF(T208=1,1,0))","v":""},{"$f":"IF(E208=\"\",\"\",R208+S208)","v":""},{"$f":"IF(E208=\"\",\"\",IF(T208=0,\"doppeltes Call\",\"\"))","v":""},null,0,null,{"$f":"IF(COUNTIF($X$6:$X208,X208)=1,1,0)","v":0},{"$f":"IF(COUNTIF(SSTN,W208)=1,IF(Z208=0,0,1),0)","v":0},{"$f":"IF(COUNTIF($Y$7:$Y208,Y208)=1,1,0)","v":0},{"$f":"UPPER(SUBSTITUTE(I208,\" \",\"\",1))","v":""},{"$f":"CONCATENATE(LEFT(D208,2),\":\",RIGHT(D208,2))","v":":::::"},{"$f":"UPPER(E208)","v":""},{"$f":"IF(LEFT(W208,1)=\"D\",LEFT(W208,3),\"XXX\")","v":"XXX"},{"$f":"CONCATENATE(W208,(LEFT(J208,1)))","v":""},{"$f":"IF(COUNTIF($W$6:$W208,$W208)=1,1,0)","v":0}]
[null,203,"",":::","",null,null,null,"",null,null,"","","",null,0,null,{"$f":"IF(COUNTIF($X$6:$X209,X209)=1,1,0)","v":0},0,{"$f":"IF(COUNTIF($Y$7:$Y209,Y209)=1,1,0)","v":0},"",":::::","","XXX","",{"$f":"IF(COUNTIF($W$6:$W209,$W209)=1,1,0)","v":0}]
[null,204,"",":::","",null,null,null,"",null,null,"","","",null,0,null,{"$f":"IF(COUNTIF($X$6:$X210,X210)=1,1,0)","v":0},0,{"$f":"IF(COUNTIF($Y$7:$Y210,Y210)=1,1,0)","v":0},"",":::::","","XXX","",{"$f":"IF(COUNTIF($W$6:$W210,$W210)=1,1,0)","v":0}]
[null,205,"",":::","",null,null,null,"",null,null,"","","",null,0,null,{"$f":"IF(COUNTIF($X$6:$X211,X211)=1,1,0)","v":0},0,{"$f":"IF(COUNTIF($Y$7:$Y211,Y211)=1,1,0)","v":0},"",":::::","","XXX","",{"$f":"IF(COUNTIF($W$6:$W211,$W211)=1,1,0)","v":0}]
[null,206,"",":::","",null,null,null,"",null,null,"","","",null,0,null,{"$f":"IF(COUNTIF($X$6:$X212,X212)=1,1,0)","v":0},0,{"$f":"IF(COUNTIF($Y$7:$Y212,Y212)=1,1,0)","v":0},"",":::::","","XXX","",{"$f":"IF(COUNTIF($W$6:$W212,$W212)=1,1,0)","v":0}]
[null,207,"",":::","",null,null,null,"",null,null,"","","",null,0,null,{"$f":"IF(COUNTIF($X$6:$X213,X213)=1,1,0)","v":0},0,{"$f":"IF(COUNTIF($Y$7:$Y213,Y213)=1,1,0)","v":0},"",":::::","","XXX","",{"$f":"IF(COUNTIF($W$6:$W213,$W213)=1,1,0)","v":0}]
[null,208,"",":::","",null,null,null,"",null,null,"","","",null,0,null,{"$f":"IF(COUNTIF($X$6:$X214,X214)=1,1,0)","v":0},0,{"$f":"IF(COUNTIF($Y$7:$Y214,Y214)=1,1,0)","v":0},"",":::::","","XXX","",{"$f":"IF(COUNTIF($W$6:$W214,$W214)=1,1,0)","v":0}]
[null,209,"",":::","",null,null,null,"",null,null,"","","",null,0,null,{"$f":"IF(COUNTIF($X$6:$X215,X215)=1,1,0)","v":0},0,{"$f":"IF(COUNTIF($Y$7:$Y215,Y215)=1,1,0)","v":0},"",":::::","","XXX","",{"$f":"IF(COUNTIF($W$6:$W215,$W215)=1,1,0)","v":0}]
[null,210,"",":::","",null,null,null,"",null,null,"","","",null,0,null,{"$f":"IF(COUNTIF($X$6:$X216,X216)=1,1,0)","v":0},0,{"$f":"IF(COUNTIF($Y$7:$Y216,Y216)=1,1,0)","v":0},"",":::::","","XXX","",{"$f":"IF(COUNTIF($W$6:$W216,$W216)=1,1,0)","v":0}]
[null,211,"",":::","",null,null,null,"",null,null,"","","",null,0,null,{"$f":"IF(COUNTIF($X$6:$X217,X217)=1,1,0)","v":0},0,{"$f":"IF(COUNTIF($Y$7:$Y217,Y217)=1,1,0)","v":0},"",":::::","","XXX","",{"$f":"IF(COUNTIF($W$6:$W217,$W217)=1,1,0)","v":0}]
[null,212,"",":::","",null,null,null,"",null,null,"","","",null,0,null,{"$f":"IF(COUNTIF($X$6:$X218,X218)=1,1,0)","v":0},0,{"$f":"IF(COUNTIF($Y$7:$Y218,Y218)=1,1,0)","v":0},"",":::::","","XXX","",{"$f":"IF(COUNTIF($W$6:$W218,$W218)=1,1,0)","v":0}]
[null,213,"",":::","",null,null,null,"",null,null,"","","",null,0,null,{"$f":"IF(COUNTIF($X$6:$X219,X219)=1,1,0)","v":0},0,{"$f":"IF(COUNTIF($Y$7:$Y219,Y219)=1,1,0)","v":0},"",":::::","","XXX","",{"$f":"IF(COUNTIF($W$6:$W219,$W219)=1,1,0)","v":0}]
[null,214,"",":::","",null,null,null,"",null,null,"","","",null,0,null,{"$f":"IF(COUNTIF($X$6:$X220,X220)=1,1,0)","v":0},0,{"$f":"IF(COUNTIF($Y$7:$Y220,Y220)=1,1,0)","v":0},"",":::::","","XXX","",{"$f":"IF(COUNTIF($W$6:$W220,$W220)=1,1,0)","v":0}]
[null,215,"",":::","",null,null,null,"",null,null,"","","",null,0,null,{"$f":"IF(COUNTIF($X$6:$X221,X221)=1,1,0)","v":0},0,{"$f":"IF(COUNTIF($Y$7:$Y221,Y221)=1,1,0)","v":0},"",":::::","","XXX","",{"$f":"IF(COUNTIF($W$6:$W221,$W221)=1,1,0)","v":0}]
[null,216,"",":::","",null,null,null,"",null,null,"","","",null,0,null,{"$f":"IF(COUNTIF($X$6:$X222,X222)=1,1,0)","v":0},0,{"$f":"IF(COUNTIF($Y$7:$Y222,Y222)=1,1,0)","v":0},"",":::::","","XXX","",{"$f":"IF(COUNTIF($W$6:$W222,$W222)=1,1,0)","v":0}]
[null,217,"",":::","",null,null,null,"",null,null,"","","",null,0,null,{"$f":"IF(COUNTIF($X$6:$X223,X223)=1,1,0)","v":0},0,{"$f":"IF(COUNTIF($Y$7:$Y223,Y223)=1,1,0)","v":0},"",":::::","","XXX","",{"$f":"IF(COUNTIF($W$6:$W223,$W223)=1,1,0)","v":0}]
[null,218,"",":::","",null,null,null,"",null,null,"","","",null,0,null,{"$f":"IF(COUNTIF($X$6:$X224,X224)=1,1,0)","v":0},0,{"$f":"IF(COUNTIF($Y$7:$Y224,Y224)=1,1,0)","v":0},"",":::::","","XXX","",{"$f":"IF(COUNTIF($W$6:$W224,$W224)=1,1,0)","v":0}]
[null,219,"",":::","",null,null,null,"",null,null,"","","",null,0,null,{"$f":"IF(COUNTIF($X$6:$X225,X225)=1,1,0)","v":0},0,{"$f":"IF(COUNTIF($Y$7:$Y225,Y225)=1,1,0)","v":0},"",":::::","","XXX","",{"$f":"IF(COUNTIF($W$6:$W225,$W225)=1,1,0)","v":0}]
[null,220,"",":::","",null,null,null,"",null,null,"","","",null,0,null,{"$f":"IF(COUNTIF($X$6:$X226,X226)=1,1,0)","v":0},0,{"$f":"IF(COUNTIF($Y$7:$Y226,Y226)=1,1,0)","v":0},"",":::::","","XXX","",{"$f":"IF(COUNTIF($W$6:$W226,$W226)=1,1,0)","v":0}]
[null,221,"",":::","",null,null,null,"",null,null,"","","",null,0,null,{"$f":"IF(COUNTIF($X$6:$X227,X227)=1,1,0)","v":0},0,{"$f":"IF(COUNTIF($Y$7:$Y227,Y227)=1,1,0)","v":0},"",":::::","","XXX","",{"$f":"IF(COUNTIF($W$6:$W227,$W227)=1,1,0)","v":0}]
[null,222,"",":::","",null,null,null,"",null,null,"","","",null,0,null,{"$f":"IF(COUNTIF($X$6:$X228,X228)=1,1,0)","v":0},0,{"$f":"IF(COUNTIF($Y$7:$Y228,Y228)=1,1,0)","v":0},"",":::::","","XXX","",{"$f":"IF(COUNTIF($W$6:$W228,$W228)=1,1,0)","v":0}]
[null,223,"",":::","",null,null,null,"",null,null,"","","",null,0,null,{"$f":"IF(COUNTIF($X$6:$X229,X229)=1,1,0)","v":0},0,{"$f":"IF(COUNTIF($Y$7:$Y229,Y229)=1,1,0)","v":0},"",":::::","","XXX","",{"$f":"IF(COUNTIF($W$6:$W229,$W229)=1,1,0)","v":0}]
[null,224,"",":::","",null,null,null,"",null,null,"","","",null,0,null,{"$f":"IF(COUNTIF($X$6:$X230,X230)=1,1,0)","v":0},0,{"$f":"IF(COUNTIF($Y$7:$Y230,Y230)=1,1,0)","v":0},"",":::::","","XXX","",{"$f":"IF(COUNTIF($W$6:$W230,$W230)=1,1,0)","v":0}]
[null,225,"",":::","",null,null,null,"",null,null,"","","",null,0,null,{"$f":"IF(COUNTIF($X$6:$X231,X231)=1,1,0)","v":0},0,{"$f":"IF(COUNTIF($Y$7:$Y231,Y231)=1,1,0)","v":0},"",":::::","","XXX","",{"$f":"IF(COUNTIF($W$6:$W231,$W231)=1,1,0)","v":0}]
[null,226,"",":::","",null,null,null,"",null,null,"","","",null,0,null,{"$f":"IF(COUNTIF($X$6:$X232,X232)=1,1,0)","v":0},0,{"$f":"IF(COUNTIF($Y$7:$Y232,Y232)=1,1,0)","v":0},"",":::::","","XXX","",{"$f":"IF(COUNTIF($W$6:$W232,$W232)=1,1,0)","v":0}]
[null,227,"",":::","",null,null,null,"",null,null,"","","",null,0,null,{"$f":"IF(COUNTIF($X$6:$X233,X233)=1,1,0)","v":0},0,{"$f":"IF(COUNTIF($Y$7:$Y233,Y233)=1,1,0)","v":0},"",":::::","","XXX","",{"$f":"IF(COUNTIF($W$6:$W233,$W233)=1,1,0)","v":0}]
[null,228,"",":::","",null,null,null,"",null,null,"","","",null,0,null,{"$f":"IF(COUNTIF($X$6:$X234,X234)=1,1,0)","v":0},0,{"$f":"IF(COUNTIF($Y$7:$Y234,Y234)=1,1,0)","v":0},"",":::::","","XXX","",{"$f":"IF(COUNTIF($W$6:$W234,$W234)=1,1,0)","v":0}]
[null,229,"",":::","",null,null,null,"",null,null,"","","",null,0,null,{"$f":"IF(COUNTIF($X$6:$X235,X235)=1,1,0)","v":0},0,{"$f":"IF(COUNTIF($Y$7:$Y235,Y235)=1,1,0)","v":0},"",":::::","","XXX","",{"$f":"IF(COUNTIF($W$6:$W235,$W235)=1,1,0)","v":0}]
[null,230,"",":::","",null,null,null,"",null,null,"","","",null,0,null,{"$f":"IF(COUNTIF($X$6:$X236,X236)=1,1,0)","v":0},0,{"$f":"IF(COUNTIF($Y$7:$Y236,Y236)=1,1,0)","v":0},"",":::::","","XXX","",{"$f":"IF(COUNTIF($W$6:$W236,$W236)=1,1,0)","v":0}]
[null,231,"",":::","",null,null,null,"",null,null,"","","",null,0,null,{"$f":"IF(COUNTIF($X$6:$X237,X237)=1,1,0)","v":0},0,{"$f":"IF(COUNTIF($Y$7:$Y237,Y237)=1,1,0)","v":0},"",":::::","","XXX","",{"$f":"IF(COUNTIF($W$6:$W237,$W237)=1,1,0)","v":0}]
[null,232,"",":::","",null,null,null,"",null,null,"","","",null,0,null,{"$f":"IF(COUNTIF($X$6:$X238,X238)=1,1,0)","v":0},0,{"$f":"IF(COUNTIF($Y$7:$Y238,Y238)=1,1,0)","v":0},"",":::::","","XXX","",{"$f":"IF(COUNTIF($W$6:$W238,$W238)=1,1,0)","v":0}]
[null,233,"",":::","",null,null,null,"",null,null,"","","",null,0,null,{"$f":"IF(COUNTIF($X$6:$X239,X239)=1,1,0)","v":0},0,{"$f":"IF(COUNTIF($Y$7:$Y239,Y239)=1,1,0)","v":0},"",":::::","","XXX","",{"$f":"IF(COUNTIF($W$6:$W239,$W239)=1,1,0)","v":0}]
[null,234,"",":::","",null,null,null,"",null,null,"","","",null,0,null,{"$f":"IF(COUNTIF($X$6:$X240,X240)=1,1,0)","v":0},0,{"$f":"IF(COUNTIF($Y$7:$Y240,Y240)=1,1,0)","v":0},"",":::::","","XXX","",{"$f":"IF(COUNTIF($W$6:$W240,$W240)=1,1,0)","v":0}]
[null,235,"",":::","",null,null,null,"",null,null,"","","",null,0,null,{"$f":"IF(COUNTIF($X$6:$X241,X241)=1,1,0)","v":0},0,{"$f":"IF(COUNTIF($Y$7:$Y241,Y241)=1,1,0)","v":0},"",":::::","","XXX","",{"$f":"IF(COUNTIF($W$6:$W241,$W241)=1,1,0)","v":0}]
[null,236,"",":::","",null,null,null,"",null,null,"","","",null,0,null,{"$f":"IF(COUNTIF($X$6:$X242,X242)=1,1,0)","v":0},0,{"$f":"IF(COUNTIF($Y$7:$Y242,Y242)=1,1,0)","v":0},"",":::::","","XXX","",{"$f":"IF(COUNTIF($W$6:$W242,$W242)=1,1,0)","v":0}]
[null,237,"",":::","",null,null,null,"",null,null,"","","",null,0,null,{"$f":"IF(COUNTIF($X$6:$X243,X243)=1,1,0)","v":0},0,{"$f":"IF(COUNTIF($Y$7:$Y243,Y243)=1,1,0)","v":0},"",":::::","","XXX","",{"$f":"IF(COUNTIF($W$6:$W243,$W243)=1,1,0)","v":0}]
[null,238,"",":::","",null,null,null,"",null,null,"","","",null,0,null,{"$f":"IF(COUNTIF($X$6:$X244,X244)=1,1,0)","v":0},0,{"$f":"IF(COUNTIF($Y$7:$Y244,Y244)=1,1,0)","v":0},"",":::::","","XXX","",{"$f":"IF(COUNTIF($W$6:$W244,$W244)=1,1,0)","v":0}]
[null,239,"",":::","",null,null,null,"",null,null,"","","",null,0,null,{"$f":"IF(COUNTIF($X$6:$X245,X245)=1,1,0)","v":0},0,{"$f":"IF(COUNTIF($Y$7:$Y245,Y245)=1,1,0)","v":0},"",":::::","","XXX","",{"$f":"IF(COUNTIF($W$6:$W245,$W245)=1,1,0)","v":0}]
[null,240,"",":::","",null,null,null,"",null,null,"","","",null,0,null,{"$f":"IF(COUNTIF($X$6:$X246,X246)=1,1,0)","v":0},0,{"$f":"IF(COUNTIF($Y$7:$Y246,Y246)=1,1,0)","v":0},"",":::::","","XXX","",{"$f":"IF(COUNTIF($W$6:$W246,$W246)=1,1,0)","v":0}]
[null,241,"",":::","",null,null,null,"",null,null,"","","",null,0,null,{"$f":"IF(COUNTIF($X$6:$X247,X247)=1,1,0)","v":0},0,{"$f":"IF(COUNTIF($Y$7:$Y247,Y247)=1,1,0)","v":0},"",":::::","","XXX","",{"$f":"IF(COUNTIF($W$6:$W247,$W247)=1,1,0)","v":0}]
[null,242,"",":::","",null,null,null,"",null,null,"","","",null,0,null,{"$f":"IF(COUNTIF($X$6:$X248,X248)=1,1,0)","v":0},0,{"$f":"IF(COUNTIF($Y$7:$Y248,Y248)=1,1,0)","v":0},"",":::::","","XXX","",{"$f":"IF(COUNTIF($W$6:$W248,$W248)=1,1,0)","v":0}]
[null,243,"",":::","",null,null,null,"",null,null,"","","",null,0,null,{"$f":"IF(COUNTIF($X$6:$X249,X249)=1,1,0)","v":0},0,{"$f":"IF(COUNTIF($Y$7:$Y249,Y249)=1,1,0)","v":0},"",":::::","","XXX","",{"$f":"IF(COUNTIF($W$6:$W249,$W249)=1,1,0)","v":0}]
[null,244,"",":::","",null,null,null,"",null,null,"","","",null,0,null,{"$f":"IF(COUNTIF($X$6:$X250,X250)=1,1,0)","v":0},0,{"$f":"IF(COUNTIF($Y$7:$Y250,Y250)=1,1,0)","v":0},"",":::::","","XXX","",{"$f":"IF(COUNTIF($W$6:$W250,$W250)=1,1,0)","v":0}]
[null,245,"",":::","",null,null,null,"",null,null,"","","",null,0,null,{"$f":"IF(COUNTIF($X$6:$X251,X251)=1,1,0)","v":0},0,{"$f":"IF(COUNTIF($Y$7:$Y251,Y251)=1,1,0)","v":0},"",":::::","","XXX","",{"$f":"IF(COUNTIF($W$6:$W251,$W251)=1,1,0)","v":0}]
[null,246,"",":::","",null,null,null,"",null,null,"","","",null,0,null,{"$f":"IF(COUNTIF($X$6:$X252,X252)=1,1,0)","v":0},0,{"$f":"IF(COUNTIF($Y$7:$Y252,Y252)=1,1,0)","v":0},"",":::::","","XXX","",{"$f":"IF(COUNTIF($W$6:$W252,$W252)=1,1,0)","v":0}]
[null,247,"",":::","",null,null,null,"",null,null,"","","",null,0,null,{"$f":"IF(COUNTIF($X$6:$X253,X253)=1,1,0)","v":0},0,{"$f":"IF(COUNTIF($Y$7:$Y253,Y253)=1,1,0)","v":0},"",":::::","","XXX","",{"$f":"IF(COUNTIF($W$6:$W253,$W253)=1,1,0)","v":0}]
[null,248,"",":::","",null,null,null,"",null,null,"","","",null,0,null,{"$f":"IF(COUNTIF($X$6:$X254,X254)=1,1,0)","v":0},0,{"$f":"IF(COUNTIF($Y$7:$Y254,Y254)=1,1,0)","v":0},"",":::::","","XXX","",{"$f":"IF(COUNTIF($W$6:$W254,$W254)=1,1,0)","v":0}]
[null,249,"",":::","",null,null,null,"",null,null,"","","",null,0,null,{"$f":"IF(COUNTIF($X$6:$X255,X255)=1,1,0)","v":0},0,{"$f":"IF(COUNTIF($Y$7:$Y255,Y255)=1,1,0)","v":0},"",":::::","","XXX","",{"$f":"IF(COUNTIF($W$6:$W255,$W255)=1,1,0)","v":0}]
[null,250,"",":::","",null,null,null,"",null,null,"","","",null,0,null,{"$f":"IF(COUNTIF($X$6:$X256,X256)=1,1,0)","v":0},0,{"$f":"IF(COUNTIF($Y$7:$Y256,Y256)=1,1,0)","v":0},"",":::::","","XXX","",{"$f":"IF(COUNTIF($W$6:$W256,$W256)=1,1,0)","v":0}]
[null,251,"",":::","",null,null,null,"",null,null,"","","",null,0,null,{"$f":"IF(COUNTIF($X$6:$X257,X257)=1,1,0)","v":0},0,{"$f":"IF(COUNTIF($Y$7:$Y257,Y257)=1,1,0)","v":0},"",":::::","","XXX","",{"$f":"IF(COUNTIF($W$6:$W257,$W257)=1,1,0)","v":0}]
[null,252,"",":::","",null,null,null,"",null,null,"","","",null,0,null,{"$f":"IF(COUNTIF($X$6:$X258,X258)=1,1,0)","v":0},0,{"$f":"IF(COUNTIF($Y$7:$Y258,Y258)=1,1,0)","v":0},"",":::::","","XXX","",{"$f":"IF(COUNTIF($W$6:$W258,$W258)=1,1,0)","v":0}]
[null,253,"",":::","",null,null,null,"",null,null,"","","",null,0,null,{"$f":"IF(COUNTIF($X$6:$X259,X259)=1,1,0)","v":0},0,{"$f":"IF(COUNTIF($Y$7:$Y259,Y259)=1,1,0)","v":0},"",":::::","","XXX","",{"$f":"IF(COUNTIF($W$6:$W259,$W259)=1,1,0)","v":0}]
[null,254,"",":::","",null,null,null,"",null,null,"","","",null,0,null,{"$f":"IF(COUNTIF($X$6:$X260,X260)=1,1,0)","v":0},0,{"$f":"IF(COUNTIF($Y$7:$Y260,Y260)=1,1,0)","v":0},"",":::::","","XXX","",{"$f":"IF(COUNTIF($W$6:$W260,$W260)=1,1,0)","v":0}]
[null,255,"",":::","",null,null,null,"",null,null,"","","",null,0,null,{"$f":"IF(COUNTIF($X$6:$X261,X261)=1,1,0)","v":0},0,{"$f":"IF(COUNTIF($Y$7:$Y261,Y261)=1,1,0)","v":0},"",":::::","","XXX","",{"$f":"IF(COUNTIF($W$6:$W261,$W261)=1,1,0)","v":0}]
[null,256,"",":::","",null,null,null,"",null,null,"","","",null,0,null,{"$f":"IF(COUNTIF($X$6:$X262,X262)=1,1,0)","v":0},0,{"$f":"IF(COUNTIF($Y$7:$Y262,Y262)=1,1,0)","v":0},"",":::::","","XXX","",{"$f":"IF(COUNTIF($W$6:$W262,$W262)=1,1,0)","v":0}]
[null,257,{"$f":"IF(F263>0,date1,\"\")","v":""},":::","",null,null,null,"",null,null,"","","",null,0,null,{"$f":"IF(COUNTIF($X$6:$X263,X263)=1,1,0)","v":0},0,{"$f":"IF(COUNTIF($Y$7:$Y263,Y263)=1,1,0)","v":0},"",":::::","","XXX","",{"$f":"IF(COUNTIF($W$6:$W263,$W263)=1,1,0)","v":0}]
[null,258,"",":::","",null,null,null,"",null,null,"","","",null,{"$f":"IF(F264>0,1,0)","v":0},null,{"$f":"IF(COUNTIF($X$6:$X264,X264)=1,1,0)","v":0},0,{"$f":"IF(COUNTIF($Y$7:$Y264,Y264)=1,1,0)","v":0},"",":::::","","XXX","",{"$f":"IF(COUNTIF($W$6:$W264,$W264)=1,1,0)","v":0}]
[null,259,"",":::","",null,null,null,"",null,null,"","","",null,0,null,{"$f":"IF(COUNTIF($X$6:$X265,X265)=1,1,0)","v":0},0,{"$f":"IF(COUNTIF($Y$7:$Y265,Y265)=1,1,0)","v":0},"",":::::","","XXX","",{"$f":"IF(COUNTIF($W$6:$W265,$W265)=1,1,0)","v":0}]
[null,260,"",":::","",null,null,null,"",null,null,"","","",null,0,null,{"$f":"IF(COUNTIF($X$6:$X266,X266)=1,1,0)","v":0},0,{"$f":"IF(COUNTIF($Y$7:$Y266,Y266)=1,1,0)","v":0},"",":::::","","XXX","",{"$f":"IF(COUNTIF($W$6:$W266,$W266)=1,1,0)","v":0}]
[null,261,"",":::","",null,null,null,"",null,null,"","","",null,0,null,{"$f":"IF(COUNTIF($X$6:$X267,X267)=1,1,0)","v":0},0,{"$f":"IF(COUNTIF($Y$7:$Y267,Y267)=1,1,0)","v":0},"",":::::","","XXX","",{"$f":"IF(COUNTIF($W$6:$W267,$W267)=1,1,0)","v":0}]
[null,262,"",":::","",null,null,null,"",null,null,"","","",null,0,null,{"$f":"IF(COUNTIF($X$6:$X268,X268)=1,1,0)","v":0},0,{"$f":"IF(COUNTIF($Y$7:$Y268,Y268)=1,1,0)","v":0},"",":::::","","XXX","",{"$f":"IF(COUNTIF($W$6:$W268,$W268)=1,1,0)","v":0}]
[null,263,"",":::","",null,null,null,"",null,null,"","","",null,0,null,{"$f":"IF(COUNTIF($X$6:$X269,X269)=1,1,0)","v":0},0,{"$f":"IF(COUNTIF($Y$7:$Y269,Y269)=1,1,0)","v":0},"",":::::","","XXX","",{"$f":"IF(COUNTIF($W$6:$W269,$W269)=1,1,0)","v":0}]
[null,264,"",":::","",null,null,null,"",null,null,"","","",null,0,null,{"$f":"IF(COUNTIF($X$6:$X270,X270)=1,1,0)","v":0},0,{"$f":"IF(COUNTIF($Y$7:$Y270,Y270)=1,1,0)","v":0},"",":::::","","XXX","",{"$f":"IF(COUNTIF($W$6:$W270,$W270)=1,1,0)","v":0}]
[null,265,"",":::","",null,null,null,"",null,null,"","","",null,0,null,{"$f":"IF(COUNTIF($X$6:$X271,X271)=1,1,0)","v":0},0,{"$f":"IF(COUNTIF($Y$7:$Y271,Y271)=1,1,0)","v":0},"",":::::","","XXX","",{"$f":"IF(COUNTIF($W$6:$W271,$W271)=1,1,0)","v":0}]
[null,266,"",":::","",null,null,null,"",null,null,{"$f":"IF(E272=\"\",\"\",IF(T272=1,1,0))","v":""},{"$f":"IF(E272=\"\",\"\",R272+S272)","v":""},{"$f":"IF(E272=\"\",\"\",IF(T272=0,\"doppeltes Call\",\"\"))","v":""},null,0,null,{"$f":"IF(COUNTIF($X$6:$X272,X272)=1,1,0)","v":0},{"$f":"IF(COUNTIF(SSTN,W272)=1,IF(Z272=0,0,1),0)","v":0},{"$f":"IF(COUNTIF($Y$7:$Y272,Y272)=1,1,0)","v":0},{"$f":"UPPER(SUBSTITUTE(I272,\" \",\"\",1))","v":""},{"$f":"CONCATENATE(LEFT(D272,2),\":\",RIGHT(D272,2))","v":":::::"},{"$f":"UPPER(E272)","v":""},{"$f":"IF(LEFT(W272,1)=\"D\",LEFT(W272,3),\"XXX\")","v":"XXX"},{"$f":"CONCATENATE(W272,(LEFT(J272,1)))","v":""},{"$f":"IF(COUNTIF($W$6:$W272,$W272)=1,1,0)","v":0}]
[null,267,"",":::","",null,null,null,"",null,null,"","","",null,0,null,{"$f":"IF(COUNTIF($X$6:$X273,X273)=1,1,0)","v":0},0,{"$f":"IF(COUNTIF($Y$7:$Y273,Y273)=1,1,0)","v":0},"",":::::","","XXX","",{"$f":"IF(COUNTIF($W$6:$W273,$W273)=1,1,0)","v":0}]
[null,268,"",":::","",null,null,null,"",null,null,"","","",null,0,null,{"$f":"IF(COUNTIF($X$6:$X274,X274)=1,1,0)","v":0},0,{"$f":"IF(COUNTIF($Y$7:$Y274,Y274)=1,1,0)","v":0},"",":::::","","XXX","",{"$f":"IF(COUNTIF($W$6:$W274,$W274)=1,1,0)","v":0}]
[null,269,"",":::","",null,null,null,"",null,null,"","","",null,0,null,{"$f":"IF(COUNTIF($X$6:$X275,X275)=1,1,0)","v":0},0,{"$f":"IF(COUNTIF($Y$7:$Y275,Y275)=1,1,0)","v":0},"",":::::","","XXX","",{"$f":"IF(COUNTIF($W$6:$W275,$W275)=1,1,0)","v":0}]
[null,270,"",":::","",null,null,null,"",null,null,"","","",null,0,null,{"$f":"IF(COUNTIF($X$6:$X276,X276)=1,1,0)","v":0},0,{"$f":"IF(COUNTIF($Y$7:$Y276,Y276)=1,1,0)","v":0},"",":::::","","XXX","",{"$f":"IF(COUNTIF($W$6:$W276,$W276)=1,1,0)","v":0}]
[null,271,"",":::","",null,null,null,"",null,null,"","","",null,0,null,{"$f":"IF(COUNTIF($X$6:$X277,X277)=1,1,0)","v":0},0,{"$f":"IF(COUNTIF($Y$7:$Y277,Y277)=1,1,0)","v":0},"",":::::","","XXX","",{"$f":"IF(COUNTIF($W$6:$W277,$W277)=1,1,0)","v":0}]
[null,272,"",":::","",null,null,null,"",null,null,"","","",null,0,null,{"$f":"IF(COUNTIF($X$6:$X278,X278)=1,1,0)","v":0},0,{"$f":"IF(COUNTIF($Y$7:$Y278,Y278)=1,1,0)","v":0},"",":::::","","XXX","",{"$f":"IF(COUNTIF($W$6:$W278,$W278)=1,1,0)","v":0}]
[null,273,"",":::","",null,null,null,"",null,null,"","","",null,0,null,{"$f":"IF(COUNTIF($X$6:$X279,X279)=1,1,0)","v":0},0,{"$f":"IF(COUNTIF($Y$7:$Y279,Y279)=1,1,0)","v":0},"",":::::","","XXX","",{"$f":"IF(COUNTIF($W$6:$W279,$W279)=1,1,0)","v":0}]
[null,274,"",":::","",null,null,null,"",null,null,"","","",null,0,null,{"$f":"IF(COUNTIF($X$6:$X280,X280)=1,1,0)","v":0},0,{"$f":"IF(COUNTIF($Y$7:$Y280,Y280)=1,1,0)","v":0},"",":::::","","XXX","",{"$f":"IF(COUNTIF($W$6:$W280,$W280)=1,1,0)","v":0}]
[null,275,"",":::","",null,null,null,"",null,null,"","","",null,0,null,{"$f":"IF(COUNTIF($X$6:$X281,X281)=1,1,0)","v":0},0,{"$f":"IF(COUNTIF($Y$7:$Y281,Y281)=1,1,0)","v":0},"",":::::","","XXX","",{"$f":"IF(COUNTIF($W$6:$W281,$W281)=1,1,0)","v":0}]
[null,276,"",":::","",null,null,null,"",null,null,"","","",null,0,null,{"$f":"IF(COUNTIF($X$6:$X282,X282)=1,1,0)","v":0},0,{"$f":"IF(COUNTIF($Y$7:$Y282,Y282)=1,1,0)","v":0},"",":::::","","XXX","",{"$f":"IF(COUNTIF($W$6:$W282,$W282)=1,1,0)","v":0}]
[null,277,"",":::","",null,null,null,"",null,null,"","","",null,0,null,{"$f":"IF(COUNTIF($X$6:$X283,X283)=1,1,0)","v":0},0,{"$f":"IF(COUNTIF($Y$7:$Y283,Y283)=1,1,0)","v":0},"",":::::","","XXX","",{"$f":"IF(COUNTIF($W$6:$W283,$W283)=1,1,0)","v":0}]
[null,278,"",":::","",null,null,null,"",null,null,"","","",null,0,null,{"$f":"IF(COUNTIF($X$6:$X284,X284)=1,1,0)","v":0},0,{"$f":"IF(COUNTIF($Y$7:$Y284,Y284)=1,1,0)","v":0},"",":::::","","XXX","",{"$f":"IF(COUNTIF($W$6:$W284,$W284)=1,1,0)","v":0}]
[null,279,"",":::","",null,null,null,"",null,null,"","","",null,0,null,{"$f":"IF(COUNTIF($X$6:$X285,X285)=1,1,0)","v":0},0,{"$f":"IF(COUNTIF($Y$7:$Y285,Y285)=1,1,0)","v":0},"",":::::","","XXX","",{"$f":"IF(COUNTIF($W$6:$W285,$W285)=1,1,0)","v":0}]
[null,280,"",":::","",null,null,null,"",null,null,"","","",null,0,null,{"$f":"IF(COUNTIF($X$6:$X286,X286)=1,1,0)","v":0},0,{"$f":"IF(COUNTIF($Y$7:$Y286,Y286)=1,1,0)","v":0},"",":::::","","XXX","",{"$f":"IF(COUNTIF($W$6:$W286,$W286)=1,1,0)","v":0}]
[null,281,"",":::","",null,null,null,"",null,null,"","","",null,0,null,{"$f":"IF(COUNTIF($X$6:$X287,X287)=1,1,0)","v":0},0,{"$f":"IF(COUNTIF($Y$7:$Y287,Y287)=1,1,0)","v":0},"",":::::","","XXX","",{"$f":"IF(COUNTIF($W$6:$W287,$W287)=1,1,0)","v":0}]
[null,282,"",":::","",null,null,null,"",null,null,"","","",null,0,null,{"$f":"IF(COUNTIF($X$6:$X288,X288)=1,1,0)","v":0},0,{"$f":"IF(COUNTIF($Y$7:$Y288,Y288)=1,1,0)","v":0},"",":::::","","XXX","",{"$f":"IF(COUNTIF($W$6:$W288,$W288)=1,1,0)","v":0}]
[null,283,"",":::","",null,null,null,"",null,null,"","","",null,0,null,{"$f":"IF(COUNTIF($X$6:$X289,X289)=1,1,0)","v":0},0,{"$f":"IF(COUNTIF($Y$7:$Y289,Y289)=1,1,0)","v":0},"",":::::","","XXX","",{"$f":"IF(COUNTIF($W$6:$W289,$W289)=1,1,0)","v":0}]
[null,284,"",":::","",null,null,null,"",null,null,"","","",null,0,null,{"$f":"IF(COUNTIF($X$6:$X290,X290)=1,1,0)","v":0},0,{"$f":"IF(COUNTIF($Y$7:$Y290,Y290)=1,1,0)","v":0},"",":::::","","XXX","",{"$f":"IF(COUNTIF($W$6:$W290,$W290)=1,1,0)","v":0}]
[null,285,"",":::","",null,null,null,"",null,null,"","","",null,0,null,{"$f":"IF(COUNTIF($X$6:$X291,X291)=1,1,0)","v":0},0,{"$f":"IF(COUNTIF($Y$7:$Y291,Y291)=1,1,0)","v":0},"",":::::","","XXX","",{"$f":"IF(COUNTIF($W$6:$W291,$W291)=1,1,0)","v":0}]
[null,286,"",":::","",null,null,null,"",null,null,"","","",null,0,null,{"$f":"IF(COUNTIF($X$6:$X292,X292)=1,1,0)","v":0},0,{"$f":"IF(COUNTIF($Y$7:$Y292,Y292)=1,1,0)","v":0},"",":::::","","XXX","",{"$f":"IF(COUNTIF($W$6:$W292,$W292)=1,1,0)","v":0}]
[null,287,"",":::","",null,null,null,"",null,null,"","","",null,0,null,{"$f":"IF(COUNTIF($X$6:$X293,X293)=1,1,0)","v":0},0,{"$f":"IF(COUNTIF($Y$7:$Y293,Y293)=1,1,0)","v":0},"",":::::","","XXX","",{"$f":"IF(COUNTIF($W$6:$W293,$W293)=1,1,0)","v":0}]
[null,288,"",":::","",null,null,null,"",null,null,"","","",null,0,null,{"$f":"IF(COUNTIF($X$6:$X294,X294)=1,1,0)","v":0},0,{"$f":"IF(COUNTIF($Y$7:$Y294,Y294)=1,1,0)","v":0},"",":::::","","XXX","",{"$f":"IF(COUNTIF($W$6:$W294,$W294)=1,1,0)","v":0}]
[null,289,"",":::","",null,null,null,"",null,null,"","","",null,0,null,{"$f":"IF(COUNTIF($X$6:$X295,X295)=1,1,0)","v":0},0,{"$f":"IF(COUNTIF($Y$7:$Y295,Y295)=1,1,0)","v":0},"",":::::","","XXX","",{"$f":"IF(COUNTIF($W$6:$W295,$W295)=1,1,0)","v":0}]
[null,290,"",":::","",null,null,null,"",null,null,"","","",null,0,null,{"$f":"IF(COUNTIF($X$6:$X296,X296)=1,1,0)","v":0},0,{"$f":"IF(COUNTIF($Y$7:$Y296,Y296)=1,1,0)","v":0},"",":::::","","XXX","",{"$f":"IF(COUNTIF($W$6:$W296,$W296)=1,1,0)","v":0}]
[null,291,"",":::","",null,null,null,"",null,null,"","","",null,0,null,{"$f":"IF(COUNTIF($X$6:$X297,X297)=1,1,0)","v":0},0,{"$f":"IF(COUNTIF($Y$7:$Y297,Y297)=1,1,0)","v":0},"",":::::","","XXX","",{"$f":"IF(COUNTIF($W$6:$W297,$W297)=1,1,0)","v":0}]
[null,292,"",":::","",null,null,null,"",null,null,"","","",null,0,null,{"$f":"IF(COUNTIF($X$6:$X298,X298)=1,1,0)","v":0},0,{"$f":"IF(COUNTIF($Y$7:$Y298,Y298)=1,1,0)","v":0},"",":::::","","XXX","",{"$f":"IF(COUNTIF($W$6:$W298,$W298)=1,1,0)","v":0}]
[null,293,"",":::","",null,null,null,"",null,null,"","","",null,0,null,{"$f":"IF(COUNTIF($X$6:$X299,X299)=1,1,0)","v":0},0,{"$f":"IF(COUNTIF($Y$7:$Y299,Y299)=1,1,0)","v":0},"",":::::","","XXX","",{"$f":"IF(COUNTIF($W$6:$W299,$W299)=1,1,0)","v":0}]
[null,294,"",":::","",null,null,null,"",null,null,"","","",null,0,null,{"$f":"IF(COUNTIF($X$6:$X300,X300)=1,1,0)","v":0},0,{"$f":"IF(COUNTIF($Y$7:$Y300,Y300)=1,1,0)","v":0},"",":::::","","XXX","",{"$f":"IF(COUNTIF($W$6:$W300,$W300)=1,1,0)","v":0}]
[null,295,"",":::","",null,null,null,"",null,null,"","","",null,0,null,{"$f":"IF(COUNTIF($X$6:$X301,X301)=1,1,0)","v":0},0,{"$f":"IF(COUNTIF($Y$7:$Y301,Y301)=1,1,0)","v":0},"",":::::","","XXX","",{"$f":"IF(COUNTIF($W$6:$W301,$W301)=1,1,0)","v":0}]
[null,296,"",":::","",null,null,null,"",null,null,"","","",null,0,null,{"$f":"IF(COUNTIF($X$6:$X302,X302)=1,1,0)","v":0},0,{"$f":"IF(COUNTIF($Y$7:$Y302,Y302)=1,1,0)","v":0},"",":::::","","XXX","",{"$f":"IF(COUNTIF($W$6:$W302,$W302)=1,1,0)","v":0}]
[null,297,"",":::","",null,null,null,"",null,null,"","","",null,0,null,{"$f":"IF(COUNTIF($X$6:$X303,X303)=1,1,0)","v":0},0,{"$f":"IF(COUNTIF($Y$7:$Y303,Y303)=1,1,0)","v":0},"",":::::","","XXX","",{"$f":"IF(COUNTIF($W$6:$W303,$W303)=1,1,0)","v":0}]
[null,298,"",":::","",null,null,null,"",null,null,"","","",null,0,null,{"$f":"IF(COUNTIF($X$6:$X304,X304)=1,1,0)","v":0},0,{"$f":"IF(COUNTIF($Y$7:$Y304,Y304)=1,1,0)","v":0},"",":::::","","XXX","",{"$f":"IF(COUNTIF($W$6:$W304,$W304)=1,1,0)","v":0}]
[null,299,"",":::","",null,null,null,"",null,null,{"$f":"IF(E305=\"\",\"\",IF(T305=1,1,0))","v":""},{"$f":"IF(E305=\"\",\"\",R305+S305)","v":""},"",null,0,null,{"$f":"IF(COUNTIF($X$6:$X305,X305)=1,1,0)","v":0},{"$f":"IF(COUNTIF(SSTN,W305)=1,IF(Z305=0,0,1),0)","v":0},{"$f":"IF(COUNTIF($Y$7:$Y305,Y305)=1,1,0)","v":0},{"$f":"UPPER(SUBSTITUTE(I305,\" \",\"\",1))","v":""},{"$f":"CONCATENATE(LEFT(D305,2),\":\",RIGHT(D305,2))","v":":::::"},{"$f":"UPPER(E305)","v":""},{"$f":"IF(LEFT(W305,1)=\"D\",LEFT(W305,3),\"XXX\")","v":"XXX"},{"$f":"CONCATENATE(W305,(LEFT(J305,1)))","v":""},{"$f":"IF(COUNTIF($W$6:$W305,$W305)=1,1,0)","v":0}]
[null,300,"",":::","",null,null,null,"",null,null,"","","",null,0,null,{"$f":"IF(COUNTIF($X$6:$X306,X306)=1,1,0)","v":0},0,{"$f":"IF(COUNTIF($Y$7:$Y306,Y306)=1,1,0)","v":0},"",":::::","","XXX","",{"$f":"IF(COUNTIF($W$6:$W306,$W306)=1,1,0)","v":0}]
[null,301,"",":::","",null,null,null,"",null,null,"","","",null,0,null,{"$f":"IF(COUNTIF($X$6:$X307,X307)=1,1,0)","v":0},0,{"$f":"IF(COUNTIF($Y$7:$Y307,Y307)=1,1,0)","v":0},"",":::::","","XXX","",{"$f":"IF(COUNTIF($W$6:$W307,$W307)=1,1,0)","v":0}]
[null,302,"",":::","",null,null,null,"",null,null,"","","",null,0,null,{"$f":"IF(COUNTIF($X$6:$X308,X308)=1,1,0)","v":0},0,{"$f":"IF(COUNTIF($Y$7:$Y308,Y308)=1,1,0)","v":0},"",":::::","","XXX","",{"$f":"IF(COUNTIF($W$6:$W308,$W308)=1,1,0)","v":0}]
[null,303,"",":::","",null,null,null,"",null,null,"","","",null,0,null,{"$f":"IF(COUNTIF($X$6:$X309,X309)=1,1,0)","v":0},0,{"$f":"IF(COUNTIF($Y$7:$Y309,Y309)=1,1,0)","v":0},"",":::::","","XXX","",{"$f":"IF(COUNTIF($W$6:$W309,$W309)=1,1,0)","v":0}]
[null,304,"",":::","",null,null,null,"",null,null,"","","",null,0,null,{"$f":"IF(COUNTIF($X$6:$X310,X310)=1,1,0)","v":0},0,{"$f":"IF(COUNTIF($Y$7:$Y310,Y310)=1,1,0)","v":0},"",":::::","","XXX","",{"$f":"IF(COUNTIF($W$6:$W310,$W310)=1,1,0)","v":0}]
[null,305,"",":::","",null,null,null,"",null,null,"","","",null,0,null,{"$f":"IF(COUNTIF($X$6:$X311,X311)=1,1,0)","v":0},0,{"$f":"IF(COUNTIF($Y$7:$Y311,Y311)=1,1,0)","v":0},"",":::::","","XXX","",{"$f":"IF(COUNTIF($W$6:$W311,$W311)=1,1,0)","v":0}]
[null,306,"",":::","",null,null,null,"",null,null,"","","",null,0,null,{"$f":"IF(COUNTIF($X$6:$X312,X312)=1,1,0)","v":0},0,{"$f":"IF(COUNTIF($Y$7:$Y312,Y312)=1,1,0)","v":0},"",":::::","","XXX","",{"$f":"IF(COUNTIF($W$6:$W312,$W312)=1,1,0)","v":0}]
[null,307,"",":::","",null,null,null,"",null,null,"","","",null,0,null,{"$f":"IF(COUNTIF($X$6:$X313,X313)=1,1,0)","v":0},0,{"$f":"IF(COUNTIF($Y$7:$Y313,Y313)=1,1,0)","v":0},"",":::::","","XXX","",{"$f":"IF(COUNTIF($W$6:$W313,$W313)=1,1,0)","v":0}]
[null,308,"",":::","",null,null,null,"",null,null,"","","",null,0,null,{"$f":"IF(COUNTIF($X$6:$X314,X314)=1,1,0)","v":0},0,{"$f":"IF(COUNTIF($Y$7:$Y314,Y314)=1,1,0)","v":0},"",":::::","","XXX","",{"$f":"IF(COUNTIF($W$6:$W314,$W314)=1,1,0)","v":0}]
[null,309,"",":::","",null,null,null,"",null,null,"","","",null,0,null,{"$f":"IF(COUNTIF($X$6:$X315,X315)=1,1,0)","v":0},0,{"$f":"IF(COUNTIF($Y$7:$Y315,Y315)=1,1,0)","v":0},"",":::::","","XXX","",{"$f":"IF(COUNTIF($W$6:$W315,$W315)=1,1,0)","v":0}]
[null,310,"",":::","",null,null,null,"",null,null,"","","",null,0,null,{"$f":"IF(COUNTIF($X$6:$X316,X316)=1,1,0)","v":0},0,{"$f":"IF(COUNTIF($Y$7:$Y316,Y316)=1,1,0)","v":0},"",":::::","","XXX","",{"$f":"IF(COUNTIF($W$6:$W316,$W316)=1,1,0)","v":0}]
[null,311,"",":::","",null,null,null,"",null,null,"","","",null,0,null,{"$f":"IF(COUNTIF($X$6:$X317,X317)=1,1,0)","v":0},0,{"$f":"IF(COUNTIF($Y$7:$Y317,Y317)=1,1,0)","v":0},"",":::::","","XXX","",{"$f":"IF(COUNTIF($W$6:$W317,$W317)=1,1,0)","v":0}]
[null,312,"",":::","",null,null,null,"",null,null,"","","",null,0,null,{"$f":"IF(COUNTIF($X$6:$X318,X318)=1,1,0)","v":0},0,{"$f":"IF(COUNTIF($Y$7:$Y318,Y318)=1,1,0)","v":0},"",":::::","","XXX","",{"$f":"IF(COUNTIF($W$6:$W318,$W318)=1,1,0)","v":0}]
[null,313,"",":::","",null,null,null,"",null,null,"","","",null,0,null,{"$f":"IF(COUNTIF($X$6:$X319,X319)=1,1,0)","v":0},0,{"$f":"IF(COUNTIF($Y$7:$Y319,Y319)=1,1,0)","v":0},"",":::::","","XXX","",{"$f":"IF(COUNTIF($W$6:$W319,$W319)=1,1,0)","v":0}]
[null,314,"",":::","",null,null,null,"",null,null,"","","",null,0,null,{"$f":"IF(COUNTIF($X$6:$X320,X320)=1,1,0)","v":0},0,{"$f":"IF(COUNTIF($Y$7:$Y320,Y320)=1,1,0)","v":0},"",":::::","","XXX","",{"$f":"IF(COUNTIF($W$6:$W320,$W320)=1,1,0)","v":0}]
[null,315,"",":::","",null,null,null,"",null,null,"","","",null,0,null,{"$f":"IF(COUNTIF($X$6:$X321,X321)=1,1,0)","v":0},0,{"$f":"IF(COUNTIF($Y$7:$Y321,Y321)=1,1,0)","v":0},"",":::::","","XXX","",{"$f":"IF(COUNTIF($W$6:$W321,$W321)=1,1,0)","v":0}]
[null,316,"",":::","",null,null,null,"",null,null,"","","",null,0,null,{"$f":"IF(COUNTIF($X$6:$X322,X322)=1,1,0)","v":0},0,{"$f":"IF(COUNTIF($Y$7:$Y322,Y322)=1,1,0)","v":0},"",":::::","","XXX","",{"$f":"IF(COUNTIF($W$6:$W322,$W322)=1,1,0)","v":0}]
[null,317,"",":::","",null,null,null,"",null,null,"","","",null,0,null,{"$f":"IF(COUNTIF($X$6:$X323,X323)=1,1,0)","v":0},0,{"$f":"IF(COUNTIF($Y$7:$Y323,Y323)=1,1,0)","v":0},"",":::::","","XXX","",{"$f":"IF(COUNTIF($W$6:$W323,$W323)=1,1,0)","v":0}]
[null,318,"",":::","",null,null,null,"",null,null,"","","",null,0,null,{"$f":"IF(COUNTIF($X$6:$X324,X324)=1,1,0)","v":0},0,{"$f":"IF(COUNTIF($Y$7:$Y324,Y324)=1,1,0)","v":0},"",":::::","","XXX","",{"$f":"IF(COUNTIF($W$6:$W324,$W324)=1,1,0)","v":0}]
[null,319,"",":::","",null,null,null,"",null,null,"","","",null,0,null,{"$f":"IF(COUNTIF($X$6:$X325,X325)=1,1,0)","v":0},0,{"$f":"IF(COUNTIF($Y$7:$Y325,Y325)=1,1,0)","v":0},"",":::::","","XXX","",{"$f":"IF(COUNTIF($W$6:$W325,$W325)=1,1,0)","v":0}]
[null,320,"",":::","",null,null,null,"",null,null,"","","",null,0,null,{"$f":"IF(COUNTIF($X$6:$X326,X326)=1,1,0)","v":0},0,{"$f":"IF(COUNTIF($Y$7:$Y326,Y326)=1,1,0)","v":0},"",":::::","","XXX","",{"$f":"IF(COUNTIF($W$6:$W326,$W326)=1,1,0)","v":0}]
[null,321,{"$f":"IF(F327>0,date1,\"\")","v":""},":::","",null,null,null,"",null,null,"","","",null,0,null,{"$f":"IF(COUNTIF($X$6:$X327,X327)=1,1,0)","v":0},0,{"$f":"IF(COUNTIF($Y$7:$Y327,Y327)=1,1,0)","v":0},"",":::::","","XXX","",{"$f":"IF(COUNTIF($W$6:$W327,$W327)=1,1,0)","v":0}]
[null,322,"",":::","",null,null,null,"",null,null,"","","",null,{"$f":"IF(F328>0,1,0)","v":0},null,{"$f":"IF(COUNTIF($X$6:$X328,X328)=1,1,0)","v":0},0,{"$f":"IF(COUNTIF($Y$7:$Y328,Y328)=1,1,0)","v":0},"",":::::","","XXX","",{"$f":"IF(COUNTIF($W$6:$W328,$W328)=1,1,0)","v":0}]
[null,323,"",":::","",null,null,null,"",null,null,"","","",null,0,null,{"$f":"IF(COUNTIF($X$6:$X329,X329)=1,1,0)","v":0},0,{"$f":"IF(COUNTIF($Y$7:$Y329,Y329)=1,1,0)","v":0},"",":::::","","XXX","",{"$f":"IF(COUNTIF($W$6:$W329,$W329)=1,1,0)","v":0}]
[null,324,"",":::","",null,null,null,"",null,null,"","","",null,0,null,{"$f":"IF(COUNTIF($X$6:$X330,X330)=1,1,0)","v":0},0,{"$f":"IF(COUNTIF($Y$7:$Y330,Y330)=1,1,0)","v":0},"",":::::","","XXX","",{"$f":"IF(COUNTIF($W$6:$W330,$W330)=1,1,0)","v":0}]
[null,325,"",":::","",null,null,null,"",null,null,"","","",null,0,null,{"$f":"IF(COUNTIF($X$6:$X331,X331)=1,1,0)","v":0},0,{"$f":"IF(COUNTIF($Y$7:$Y331,Y331)=1,1,0)","v":0},"",":::::","","XXX","",{"$f":"IF(COUNTIF($W$6:$W331,$W331)=1,1,0)","v":0}]
[null,326,"",":::","",null,null,null,"",null,null,"","","",null,0,null,{"$f":"IF(COUNTIF($X$6:$X332,X332)=1,1,0)","v":0},0,{"$f":"IF(COUNTIF($Y$7:$Y332,Y332)=1,1,0)","v":0},"",":::::","","XXX","",{"$f":"IF(COUNTIF($W$6:$W332,$W332)=1,1,0)","v":0}]
[null,327,"",":::","",null,null,null,"",null,null,"","","",null,0,null,{"$f":"IF(COUNTIF($X$6:$X333,X333)=1,1,0)","v":0},0,{"$f":"IF(COUNTIF($Y$7:$Y333,Y333)=1,1,0)","v":0},"",":::::","","XXX","",{"$f":"IF(COUNTIF($W$6:$W333,$W333)=1,1,0)","v":0}]
[null,328,"",":::","",null,null,null,"",null,null,"","","",null,0,null,{"$f":"IF(COUNTIF($X$6:$X334,X334)=1,1,0)","v":0},0,{"$f":"IF(COUNTIF($Y$7:$Y334,Y334)=1,1,0)","v":0},"",":::::","","XXX","",{"$f":"IF(COUNTIF($W$6:$W334,$W334)=1,1,0)","v":0}]
[null,329,"",":::","",null,null,null,"",null,null,"","","",null,0,null,{"$f":"IF(COUNTIF($X$6:$X335,X335)=1,1,0)","v":0},0,{"$f":"IF(COUNTIF($Y$7:$Y335,Y335)=1,1,0)","v":0},"",":::::","","XXX","",{"$f":"IF(COUNTIF($W$6:$W335,$W335)=1,1,0)","v":0}]
[null,330,"",":::","",null,null,null,"",null,null,"","",{"$f":"IF(E336=\"\",\"\",IF(T336=0,\"doppeltes Call\",\"\"))","v":""},null,0,null,{"$f":"IF(COUNTIF($X$6:$X336,X336)=1,1,0)","v":0},0,{"$f":"IF(COUNTIF($Y$7:$Y336,Y336)=1,1,0)","v":0},"",":::::","","XXX","",{"$f":"IF(COUNTIF($W$6:$W336,$W336)=1,1,0)","v":0}]
[null,331,"",":::","",null,null,null,"",null,null,"","","",null,0,null,{"$f":"IF(COUNTIF($X$6:$X337,X337)=1,1,0)","v":0},0,{"$f":"IF(COUNTIF($Y$7:$Y337,Y337)=1,1,0)","v":0},"",":::::","","XXX","",{"$f":"IF(COUNTIF($W$6:$W337,$W337)=1,1,0)","v":0}]
[null,332,"",":::","",null,null,null,"",null,null,"","","",null,0,null,{"$f":"IF(COUNTIF($X$6:$X338,X338)=1,1,0)","v":0},0,{"$f":"IF(COUNTIF($Y$7:$Y338,Y338)=1,1,0)","v":0},"",":::::","","XXX","",{"$f":"IF(COUNTIF($W$6:$W338,$W338)=1,1,0)","v":0}]
[null,333,"",":::","",null,null,null,"",null,null,"","","",null,0,null,{"$f":"IF(COUNTIF($X$6:$X339,X339)=1,1,0)","v":0},0,{"$f":"IF(COUNTIF($Y$7:$Y339,Y339)=1,1,0)","v":0},"",":::::","","XXX","",{"$f":"IF(COUNTIF($W$6:$W339,$W339)=1,1,0)","v":0}]
[null,334,"",":::","",null,null,null,"",null,null,"","","",null,0,null,{"$f":"IF(COUNTIF($X$6:$X340,X340)=1,1,0)","v":0},0,{"$f":"IF(COUNTIF($Y$7:$Y340,Y340)=1,1,0)","v":0},"",":::::","","XXX","",{"$f":"IF(COUNTIF($W$6:$W340,$W340)=1,1,0)","v":0}]
[null,335,"",":::","",null,null,null,"",null,null,"","","",null,0,null,{"$f":"IF(COUNTIF($X$6:$X341,X341)=1,1,0)","v":0},0,{"$f":"IF(COUNTIF($Y$7:$Y341,Y341)=1,1,0)","v":0},"",":::::","","XXX","",{"$f":"IF(COUNTIF($W$6:$W341,$W341)=1,1,0)","v":0}]
[null,336,"",":::","",null,null,null,"",null,null,"","","",null,0,null,{"$f":"IF(COUNTIF($X$6:$X342,X342)=1,1,0)","v":0},0,{"$f":"IF(COUNTIF($Y$7:$Y342,Y342)=1,1,0)","v":0},"",":::::","","XXX","",{"$f":"IF(COUNTIF($W$6:$W342,$W342)=1,1,0)","v":0}]
[null,337,"",":::","",null,null,null,"",null,null,"","","",null,0,null,{"$f":"IF(COUNTIF($X$6:$X343,X343)=1,1,0)","v":0},0,{"$f":"IF(COUNTIF($Y$7:$Y343,Y343)=1,1,0)","v":0},"",":::::","","XXX","",{"$f":"IF(COUNTIF($W$6:$W343,$W343)=1,1,0)","v":0}]
[null,338,"",":::","",null,null,null,"",null,null,"","","",null,0,null,{"$f":"IF(COUNTIF($X$6:$X344,X344)=1,1,0)","v":0},0,{"$f":"IF(COUNTIF($Y$7:$Y344,Y344)=1,1,0)","v":0},"",":::::","","XXX","",{"$f":"IF(COUNTIF($W$6:$W344,$W344)=1,1,0)","v":0}]
[null,339,"",":::","",null,null,null,"",null,null,"","","",null,0,null,{"$f":"IF(COUNTIF($X$6:$X345,X345)=1,1,0)","v":0},0,{"$f":"IF(COUNTIF($Y$7:$Y345,Y345)=1,1,0)","v":0},"",":::::","","XXX","",{"$f":"IF(COUNTIF($W$6:$W345,$W345)=1,1,0)","v":0}]
[null,340,"",":::","",null,null,null,"",null,null,"","","",null,0,null,{"$f":"IF(COUNTIF($X$6:$X346,X346)=1,1,0)","v":0},0,{"$f":"IF(COUNTIF($Y$7:$Y346,Y346)=1,1,0)","v":0},"",":::::","","XXX","",{"$f":"IF(COUNTIF($W$6:$W346,$W346)=1,1,0)","v":0}]
[null,341,"",":::","",null,null,null,"",null,null,"","","",null,0,null,{"$f":"IF(COUNTIF($X$6:$X347,X347)=1,1,0)","v":0},0,{"$f":"IF(COUNTIF($Y$7:$Y347,Y347)=1,1,0)","v":0},"",":::::","","XXX","",{"$f":"IF(COUNTIF($W$6:$W347,$W347)=1,1,0)","v":0}]
[null,342,"",":::","",null,null,null,"",null,null,"","","",null,0,null,{"$f":"IF(COUNTIF($X$6:$X348,X348)=1,1,0)","v":0},0,{"$f":"IF(COUNTIF($Y$7:$Y348,Y348)=1,1,0)","v":0},"",":::::","","XXX","",{"$f":"IF(COUNTIF($W$6:$W348,$W348)=1,1,0)","v":0}]
[null,343,"",":::","",null,null,null,"",null,null,"","","",null,0,null,{"$f":"IF(COUNTIF($X$6:$X349,X349)=1,1,0)","v":0},0,{"$f":"IF(COUNTIF($Y$7:$Y349,Y349)=1,1,0)","v":0},"",":::::","","XXX","",{"$f":"IF(COUNTIF($W$6:$W349,$W349)=1,1,0)","v":0}]
[null,344,"",":::","",null,null,null,"",null,null,"","","",null,0,null,{"$f":"IF(COUNTIF($X$6:$X350,X350)=1,1,0)","v":0},0,{"$f":"IF(COUNTIF($Y$7:$Y350,Y350)=1,1,0)","v":0},"",":::::","","XXX","",{"$f":"IF(COUNTIF($W$6:$W350,$W350)=1,1,0)","v":0}]
[null,345,"",":::","",null,null,null,"",null,null,"","","",null,0,null,{"$f":"IF(COUNTIF($X$6:$X351,X351)=1,1,0)","v":0},0,{"$f":"IF(COUNTIF($Y$7:$Y351,Y351)=1,1,0)","v":0},"",":::::","","XXX","",{"$f":"IF(COUNTIF($W$6:$W351,$W351)=1,1,0)","v":0}]
[null,346,"",":::","",null,null,null,"",null,null,"","","",null,0,null,{"$f":"IF(COUNTIF($X$6:$X352,X352)=1,1,0)","v":0},0,{"$f":"IF(COUNTIF($Y$7:$Y352,Y352)=1,1,0)","v":0},"",":::::","","XXX","",{"$f":"IF(COUNTIF($W$6:$W352,$W352)=1,1,0)","v":0}]
[null,347,"",":::","",null,null,null,"",null,null,"","","",null,0,null,{"$f":"IF(COUNTIF($X$6:$X353,X353)=1,1,0)","v":0},0,{"$f":"IF(COUNTIF($Y$7:$Y353,Y353)=1,1,0)","v":0},"",":::::","","XXX","",{"$f":"IF(COUNTIF($W$6:$W353,$W353)=1,1,0)","v":0}]
[null,348,"",":::","",null,null,null,"",null,null,"","","",null,0,null,{"$f":"IF(COUNTIF($X$6:$X354,X354)=1,1,0)","v":0},0,{"$f":"IF(COUNTIF($Y$7:$Y354,Y354)=1,1,0)","v":0},"",":::::","","XXX","",{"$f":"IF(COUNTIF($W$6:$W354,$W354)=1,1,0)","v":0}]
[null,349,"",":::","",null,null,null,"",null,null,"","","",null,0,null,{"$f":"IF(COUNTIF($X$6:$X355,X355)=1,1,0)","v":0},0,{"$f":"IF(COUNTIF($Y$7:$Y355,Y355)=1,1,0)","v":0},"",":::::","","XXX","",{"$f":"IF(COUNTIF($W$6:$W355,$W355)=1,1,0)","v":0}]
[null,350,"",":::","",null,null,null,"",null,null,"","","",null,0,null,{"$f":"IF(COUNTIF($X$6:$X356,X356)=1,1,0)","v":0},0,{"$f":"IF(COUNTIF($Y$7:$Y356,Y356)=1,1,0)","v":0},"",":::::","","XXX","",{"$f":"IF(COUNTIF($W$6:$W356,$W356)=1,1,0)","v":0}]
[null,351,"",":::","",null,null,null,"",null,null,"","","",null,0,null,{"$f":"IF(COUNTIF($X$6:$X357,X357)=1,1,0)","v":0},0,{"$f":"IF(COUNTIF($Y$7:$Y357,Y357)=1,1,0)","v":0},"",":::::","","XXX","",{"$f":"IF(COUNTIF($W$6:$W357,$W357)=1,1,0)","v":0}]
[null,352,"",":::","",null,null,null,"",null,null,"","","",null,0,null,{"$f":"IF(COUNTIF($X$6:$X358,X358)=1,1,0)","v":0},0,{"$f":"IF(COUNTIF($Y$7:$Y358,Y358)=1,1,0)","v":0},"",":::::","","XXX","",{"$f":"IF(COUNTIF($W$6:$W358,$W358)=1,1,0)","v":0}]
[null,353,"",":::","",null,null,null,"",null,null,"","","",null,0,null,{"$f":"IF(COUNTIF($X$6:$X359,X359)=1,1,0)","v":0},0,{"$f":"IF(COUNTIF($Y$7:$Y359,Y359)=1,1,0)","v":0},"",":::::","","XXX","",{"$f":"IF(COUNTIF($W$6:$W359,$W359)=1,1,0)","v":0}]
[null,354,"",":::","",null,null,null,"",null,null,"","","",null,0,null,{"$f":"IF(COUNTIF($X$6:$X360,X360)=1,1,0)","v":0},0,{"$f":"IF(COUNTIF($Y$7:$Y360,Y360)=1,1,0)","v":0},"",":::::","","XXX","",{"$f":"IF(COUNTIF($W$6:$W360,$W360)=1,1,0)","v":0}]
[null,355,"",":::","",null,null,null,"",null,null,"","","",null,0,null,{"$f":"IF(COUNTIF($X$6:$X361,X361)=1,1,0)","v":0},0,{"$f":"IF(COUNTIF($Y$7:$Y361,Y361)=1,1,0)","v":0},"",":::::","","XXX","",{"$f":"IF(COUNTIF($W$6:$W361,$W361)=1,1,0)","v":0}]
[null,356,"",":::","",null,null,null,"",null,null,"","","",null,0,null,{"$f":"IF(COUNTIF($X$6:$X362,X362)=1,1,0)","v":0},0,{"$f":"IF(COUNTIF($Y$7:$Y362,Y362)=1,1,0)","v":0},"",":::::","","XXX","",{"$f":"IF(COUNTIF($W$6:$W362,$W362)=1,1,0)","v":0}]
[null,357,"",":::","",null,null,null,"",null,null,"","","",null,0,null,{"$f":"IF(COUNTIF($X$6:$X363,X363)=1,1,0)","v":0},0,{"$f":"IF(COUNTIF($Y$7:$Y363,Y363)=1,1,0)","v":0},"",":::::","","XXX","",{"$f":"IF(COUNTIF($W$6:$W363,$W363)=1,1,0)","v":0}]
[null,358,"",":::","",null,null,null,"",null,null,"","","",null,0,null,{"$f":"IF(COUNTIF($X$6:$X364,X364)=1,1,0)","v":0},0,{"$f":"IF(COUNTIF($Y$7:$Y364,Y364)=1,1,0)","v":0},"",":::::","","XXX","",{"$f":"IF(COUNTIF($W$6:$W364,$W364)=1,1,0)","v":0}]
[null,359,"",":::","",null,null,null,"",null,null,"","","",null,0,null,{"$f":"IF(COUNTIF($X$6:$X365,X365)=1,1,0)","v":0},0,{"$f":"IF(COUNTIF($Y$7:$Y365,Y365)=1,1,0)","v":0},"",":::::","","XXX","",{"$f":"IF(COUNTIF($W$6:$W365,$W365)=1,1,0)","v":0}]
[null,360,"",":::","",null,null,null,"",null,null,"","","",null,0,null,{"$f":"IF(COUNTIF($X$6:$X366,X366)=1,1,0)","v":0},0,{"$f":"IF(COUNTIF($Y$7:$Y366,Y366)=1,1,0)","v":0},"",":::::","","XXX","",{"$f":"IF(COUNTIF($W$6:$W366,$W366)=1,1,0)","v":0}]
[null,361,"",":::","",null,null,null,"",null,null,"","","",null,0,null,{"$f":"IF(COUNTIF($X$6:$X367,X367)=1,1,0)","v":0},0,{"$f":"IF(COUNTIF($Y$7:$Y367,Y367)=1,1,0)","v":0},"",":::::","","XXX","",{"$f":"IF(COUNTIF($W$6:$W367,$W367)=1,1,0)","v":0}]
[null,362,"",":::","",null,null,null,"",null,null,"","","",null,0,null,{"$f":"IF(COUNTIF($X$6:$X368,X368)=1,1,0)","v":0},0,{"$f":"IF(COUNTIF($Y$7:$Y368,Y368)=1,1,0)","v":0},"",":::::","","XXX","",{"$f":"IF(COUNTIF($W$6:$W368,$W368)=1,1,0)","v":0}]
[null,363,"",":::","",null,null,null,"",null,null,{"$f":"IF(E369=\"\",\"\",IF(T369=1,1,0))","v":""},{"$f":"IF(E369=\"\",\"\",R369+S369)","v":""},"",null,0,null,{"$f":"IF(COUNTIF($X$6:$X369,X369)=1,1,0)","v":0},{"$f":"IF(COUNTIF(SSTN,W369)=1,IF(Z369=0,0,1),0)","v":0},{"$f":"IF(COUNTIF($Y$7:$Y369,Y369)=1,1,0)","v":0},{"$f":"UPPER(SUBSTITUTE(I369,\" \",\"\",1))","v":""},{"$f":"CONCATENATE(LEFT(D369,2),\":\",RIGHT(D369,2))","v":":::::"},{"$f":"UPPER(E369)","v":""},{"$f":"IF(LEFT(W369,1)=\"D\",LEFT(W369,3),\"XXX\")","v":"XXX"},{"$f":"CONCATENATE(W369,(LEFT(J369,1)))","v":""},{"$f":"IF(COUNTIF($W$6:$W369,$W369)=1,1,0)","v":0}]
[null,364,"",":::","",null,null,null,"",null,null,"","","",null,0,null,{"$f":"IF(COUNTIF($X$6:$X370,X370)=1,1,0)","v":0},0,{"$f":"IF(COUNTIF($Y$7:$Y370,Y370)=1,1,0)","v":0},"",":::::","","XXX","",{"$f":"IF(COUNTIF($W$6:$W370,$W370)=1,1,0)","v":0}]
[null,365,"",":::","",null,null,null,"",null,null,"","","",null,0,null,{"$f":"IF(COUNTIF($X$6:$X371,X371)=1,1,0)","v":0},0,{"$f":"IF(COUNTIF($Y$7:$Y371,Y371)=1,1,0)","v":0},"",":::::","","XXX","",{"$f":"IF(COUNTIF($W$6:$W371,$W371)=1,1,0)","v":0}]
[null,366,"",":::","",null,null,null,"",null,null,"","","",null,0,null,{"$f":"IF(COUNTIF($X$6:$X372,X372)=1,1,0)","v":0},0,{"$f":"IF(COUNTIF($Y$7:$Y372,Y372)=1,1,0)","v":0},"",":::::","","XXX","",{"$f":"IF(COUNTIF($W$6:$W372,$W372)=1,1,0)","v":0}]
[null,367,"",":::","",null,null,null,"",null,null,"","","",null,0,null,{"$f":"IF(COUNTIF($X$6:$X373,X373)=1,1,0)","v":0},0,{"$f":"IF(COUNTIF($Y$7:$Y373,Y373)=1,1,0)","v":0},"",":::::","","XXX","",{"$f":"IF(COUNTIF($W$6:$W373,$W373)=1,1,0)","v":0}]
[null,368,"",":::","",null,null,null,"",null,null,"","","",null,0,null,{"$f":"IF(COUNTIF($X$6:$X374,X374)=1,1,0)","v":0},0,{"$f":"IF(COUNTIF($Y$7:$Y374,Y374)=1,1,0)","v":0},"",":::::","","XXX","",{"$f":"IF(COUNTIF($W$6:$W374,$W374)=1,1,0)","v":0}]
[null,369,"",":::","",null,null,null,"",null,null,"","","",null,0,null,{"$f":"IF(COUNTIF($X$6:$X375,X375)=1,1,0)","v":0},0,{"$f":"IF(COUNTIF($Y$7:$Y375,Y375)=1,1,0)","v":0},"",":::::","","XXX","",{"$f":"IF(COUNTIF($W$6:$W375,$W375)=1,1,0)","v":0}]
[null,370,"",":::","",null,null,null,"",null,null,"","","",null,0,null,{"$f":"IF(COUNTIF($X$6:$X376,X376)=1,1,0)","v":0},0,{"$f":"IF(COUNTIF($Y$7:$Y376,Y376)=1,1,0)","v":0},"",":::::","","XXX","",{"$f":"IF(COUNTIF($W$6:$W376,$W376)=1,1,0)","v":0}]
[null,371,"",":::","",null,null,null,"",null,null,"","","",null,0,null,{"$f":"IF(COUNTIF($X$6:$X377,X377)=1,1,0)","v":0},0,{"$f":"IF(COUNTIF($Y$7:$Y377,Y377)=1,1,0)","v":0},"",":::::","","XXX","",{"$f":"IF(COUNTIF($W$6:$W377,$W377)=1,1,0)","v":0}]
[null,372,"",":::","",null,null,null,"",null,null,"","","",null,0,null,{"$f":"IF(COUNTIF($X$6:$X378,X378)=1,1,0)","v":0},0,{"$f":"IF(COUNTIF($Y$7:$Y378,Y378)=1,1,0)","v":0},"",":::::","","XXX","",{"$f":"IF(COUNTIF($W$6:$W378,$W378)=1,1,0)","v":0}]
[null,373,"",":::","",null,null,null,"",null,null,"","","",null,0,null,{"$f":"IF(COUNTIF($X$6:$X379,X379)=1,1,0)","v":0},0,{"$f":"IF(COUNTIF($Y$7:$Y379,Y379)=1,1,0)","v":0},"",":::::","","XXX","",{"$f":"IF(COUNTIF($W$6:$W379,$W379)=1,1,0)","v":0}]
[null,374,"",":::","",null,null,null,"",null,null,"","","",null,0,null,{"$f":"IF(COUNTIF($X$6:$X380,X380)=1,1,0)","v":0},0,{"$f":"IF(COUNTIF($Y$7:$Y380,Y380)=1,1,0)","v":0},"",":::::","","XXX","",{"$f":"IF(COUNTIF($W$6:$W380,$W380)=1,1,0)","v":0}]
[null,375,"",":::","",null,null,null,"",null,null,"","","",null,0,null,{"$f":"IF(COUNTIF($X$6:$X381,X381)=1,1,0)","v":0},0,{"$f":"IF(COUNTIF($Y$7:$Y381,Y381)=1,1,0)","v":0},"",":::::","","XXX","",{"$f":"IF(COUNTIF($W$6:$W381,$W381)=1,1,0)","v":0}]
[null,376,"",":::","",null,null,null,"",null,null,"","","",null,0,null,{"$f":"IF(COUNTIF($X$6:$X382,X382)=1,1,0)","v":0},0,{"$f":"IF(COUNTIF($Y$7:$Y382,Y382)=1,1,0)","v":0},"",":::::","","XXX","",{"$f":"IF(COUNTIF($W$6:$W382,$W382)=1,1,0)","v":0}]
[null,377,"",":::","",null,null,null,"",null,null,"","","",null,0,null,{"$f":"IF(COUNTIF($X$6:$X383,X383)=1,1,0)","v":0},0,{"$f":"IF(COUNTIF($Y$7:$Y383,Y383)=1,1,0)","v":0},"",":::::","","XXX","",{"$f":"IF(COUNTIF($W$6:$W383,$W383)=1,1,0)","v":0}]
[null,378,"",":::","",null,null,null,"",null,null,"","","",null,0,null,{"$f":"IF(COUNTIF($X$6:$X384,X384)=1,1,0)","v":0},0,{"$f":"IF(COUNTIF($Y$7:$Y384,Y384)=1,1,0)","v":0},"",":::::","","XXX","",{"$f":"IF(COUNTIF($W$6:$W384,$W384)=1,1,0)","v":0}]
[null,379,"",":::","",null,null,null,"",null,null,"","","",null,0,null,{"$f":"IF(COUNTIF($X$6:$X385,X385)=1,1,0)","v":0},0,{"$f":"IF(COUNTIF($Y$7:$Y385,Y385)=1,1,0)","v":0},"",":::::","","XXX","",{"$f":"IF(COUNTIF($W$6:$W385,$W385)=1,1,0)","v":0}]
[null,380,"",":::","",null,null,null,"",null,null,"","","",null,0,null,{"$f":"IF(COUNTIF($X$6:$X386,X386)=1,1,0)","v":0},0,{"$f":"IF(COUNTIF($Y$7:$Y386,Y386)=1,1,0)","v":0},"",":::::","","XXX","",{"$f":"IF(COUNTIF($W$6:$W386,$W386)=1,1,0)","v":0}]
[null,381,"",":::","",null,null,null,"",null,null,"","","",null,0,null,{"$f":"IF(COUNTIF($X$6:$X387,X387)=1,1,0)","v":0},0,{"$f":"IF(COUNTIF($Y$7:$Y387,Y387)=1,1,0)","v":0},"",":::::","","XXX","",{"$f":"IF(COUNTIF($W$6:$W387,$W387)=1,1,0)","v":0}]
[null,382,"",":::","",null,null,null,"",null,null,"","","",null,0,null,{"$f":"IF(COUNTIF($X$6:$X388,X388)=1,1,0)","v":0},0,{"$f":"IF(COUNTIF($Y$7:$Y388,Y388)=1,1,0)","v":0},"",":::::","","XXX","",{"$f":"IF(COUNTIF($W$6:$W388,$W388)=1,1,0)","v":0}]
[null,383,"",":::","",null,null,null,"",null,null,"","","",null,0,null,{"$f":"IF(COUNTIF($X$6:$X389,X389)=1,1,0)","v":0},0,{"$f":"IF(COUNTIF($Y$7:$Y389,Y389)=1,1,0)","v":0},"",":::::","","XXX","",{"$f":"IF(COUNTIF($W$6:$W389,$W389)=1,1,0)","v":0}]
[null,384,"",":::","",null,null,null,"",null,null,"","","",null,0,null,{"$f":"IF(COUNTIF($X$6:$X390,X390)=1,1,0)","v":0},0,{"$f":"IF(COUNTIF($Y$7:$Y390,Y390)=1,1,0)","v":0},"",":::::","","XXX","",{"$f":"IF(COUNTIF($W$6:$W390,$W390)=1,1,0)","v":0}]
[null,385,{"$f":"IF(F391>0,date1,\"\")","v":""},":::","",null,null,null,"",null,null,"","","",null,0,null,{"$f":"IF(COUNTIF($X$6:$X391,X391)=1,1,0)","v":0},0,{"$f":"IF(COUNTIF($Y$7:$Y391,Y391)=1,1,0)","v":0},"",":::::","","XXX","",{"$f":"IF(COUNTIF($W$6:$W391,$W391)=1,1,0)","v":0}]
[null,386,"",":::","",null,null,null,"",null,null,"","","",null,{"$f":"IF(F392>0,1,0)","v":0},null,{"$f":"IF(COUNTIF($X$6:$X392,X392)=1,1,0)","v":0},0,{"$f":"IF(COUNTIF($Y$7:$Y392,Y392)=1,1,0)","v":0},"",":::::","","XXX","",{"$f":"IF(COUNTIF($W$6:$W392,$W392)=1,1,0)","v":0}]
[null,387,"",":::","",null,null,null,"",null,null,"","","",null,0,null,{"$f":"IF(COUNTIF($X$6:$X393,X393)=1,1,0)","v":0},0,{"$f":"IF(COUNTIF($Y$7:$Y393,Y393)=1,1,0)","v":0},"",":::::","","XXX","",{"$f":"IF(COUNTIF($W$6:$W393,$W393)=1,1,0)","v":0}]
[null,388,"",":::","",null,null,null,"",null,null,"","","",null,0,null,{"$f":"IF(COUNTIF($X$6:$X394,X394)=1,1,0)","v":0},0,{"$f":"IF(COUNTIF($Y$7:$Y394,Y394)=1,1,0)","v":0},"",":::::","","XXX","",{"$f":"IF(COUNTIF($W$6:$W394,$W394)=1,1,0)","v":0}]
[null,389,"",":::","",null,null,null,"",null,null,"","","",null,0,null,{"$f":"IF(COUNTIF($X$6:$X395,X395)=1,1,0)","v":0},0,{"$f":"IF(COUNTIF($Y$7:$Y395,Y395)=1,1,0)","v":0},"",":::::","","XXX","",{"$f":"IF(COUNTIF($W$6:$W395,$W395)=1,1,0)","v":0}]
[null,390,"",":::","",null,null,null,"",null,null,"","","",null,0,null,{"$f":"IF(COUNTIF($X$6:$X396,X396)=1,1,0)","v":0},0,{"$f":"IF(COUNTIF($Y$7:$Y396,Y396)=1,1,0)","v":0},"",":::::","","XXX","",{"$f":"IF(COUNTIF($W$6:$W396,$W396)=1,1,0)","v":0}]
[null,391,"",":::","",null,null,null,"",null,null,"","","",null,0,null,{"$f":"IF(COUNTIF($X$6:$X397,X397)=1,1,0)","v":0},0,{"$f":"IF(COUNTIF($Y$7:$Y397,Y397)=1,1,0)","v":0},"",":::::","","XXX","",{"$f":"IF(COUNTIF($W$6:$W397,$W397)=1,1,0)","v":0}]
[null,392,"",":::","",null,null,null,"",null,null,"","","",null,0,null,{"$f":"IF(COUNTIF($X$6:$X398,X398)=1,1,0)","v":0},0,{"$f":"IF(COUNTIF($Y$7:$Y398,Y398)=1,1,0)","v":0},"",":::::","","XXX","",{"$f":"IF(COUNTIF($W$6:$W398,$W398)=1,1,0)","v":0}]
[null,393,"",":::","",null,null,null,"",null,null,"","","",null,0,null,{"$f":"IF(COUNTIF($X$6:$X399,X399)=1,1,0)","v":0},0,{"$f":"IF(COUNTIF($Y$7:$Y399,Y399)=1,1,0)","v":0},"",":::::","","XXX","",{"$f":"IF(COUNTIF($W$6:$W399,$W399)=1,1,0)","v":0}]
[null,394,"",":::","",null,null,null,"",null,null,"","",{"$f":"IF(E400=\"\",\"\",IF(T400=0,\"doppeltes Call\",\"\"))","v":""},null,0,null,{"$f":"IF(COUNTIF($X$6:$X400,X400)=1,1,0)","v":0},0,{"$f":"IF(COUNTIF($Y$7:$Y400,Y400)=1,1,0)","v":0},"",":::::","","XXX","",{"$f":"IF(COUNTIF($W$6:$W400,$W400)=1,1,0)","v":0}]
[null,395,"",":::","",null,null,null,"",null,null,"","","",null,0,null,{"$f":"IF(COUNTIF($X$6:$X401,X401)=1,1,0)","v":0},0,{"$f":"IF(COUNTIF($Y$7:$Y401,Y401)=1,1,0)","v":0},"",":::::","","XXX","",{"$f":"IF(COUNTIF($W$6:$W401,$W401)=1,1,0)","v":0}]
[null,396,"",":::","",null,null,null,"",null,null,"","","",null,0,null,{"$f":"IF(COUNTIF($X$6:$X402,X402)=1,1,0)","v":0},0,{"$f":"IF(COUNTIF($Y$7:$Y402,Y402)=1,1,0)","v":0},"",":::::","","XXX","",{"$f":"IF(COUNTIF($W$6:$W402,$W402)=1,1,0)","v":0}]
[null,397,"",":::","",null,null,null,"",null,null,"","","",null,0,null,{"$f":"IF(COUNTIF($X$6:$X403,X403)=1,1,0)","v":0},0,{"$f":"IF(COUNTIF($Y$7:$Y403,Y403)=1,1,0)","v":0},"",":::::","","XXX","",{"$f":"IF(COUNTIF($W$6:$W403,$W403)=1,1,0)","v":0}]
[null,398,"",":::","",null,null,null,"",null,null,"","","",null,0,null,{"$f":"IF(COUNTIF($X$6:$X404,X404)=1,1,0)","v":0},0,{"$f":"IF(COUNTIF($Y$7:$Y404,Y404)=1,1,0)","v":0},"",":::::","","XXX","",{"$f":"IF(COUNTIF($W$6:$W404,$W404)=1,1,0)","v":0}]
[null,399,"",":::","",null,null,null,"",null,null,"","","",null,0,null,{"$f":"IF(COUNTIF($X$6:$X405,X405)=1,1,0)","v":0},0,{"$f":"IF(COUNTIF($Y$7:$Y405,Y405)=1,1,0)","v":0},"",":::::","","XXX","",{"$f":"IF(COUNTIF($W$6:$W405,$W405)=1,1,0)","v":0}]
[null,400,"",":::","",null,null,null,"",null,null,"","","",null,0,null,{"$f":"IF(COUNTIF($X$6:$X406,X406)=1,1,0)","v":0},0,{"$f":"IF(COUNTIF($Y$7:$Y406,Y406)=1,1,0)","v":0},"",":::::","","XXX","",{"$f":"IF(COUNTIF($W$6:$W406,$W406)=1,1,0)","v":0}]
[null,401,"",":::","",null,null,null,"",null,null,"","","",null,0,null,{"$f":"IF(COUNTIF($X$6:$X407,X407)=1,1,0)","v":0},0,{"$f":"IF(COUNTIF($Y$7:$Y407,Y407)=1,1,0)","v":0},"",":::::","","XXX","",{"$f":"IF(COUNTIF($W$6:$W407,$W407)=1,1,0)","v":0}]
[null,402,"",":::","",null,null,null,"",null,null,"","","",null,0,null,{"$f":"IF(COUNTIF($X$6:$X408,X408)=1,1,0)","v":0},0,{"$f":"IF(COUNTIF($Y$7:$Y408,Y408)=1,1,0)","v":0},"",":::::","","XXX","",{"$f":"IF(COUNTIF($W$6:$W408,$W408)=1,1,0)","v":0}]
[null,403,"",":::","",null,null,null,"",null,null,"","","",null,0,null,{"$f":"IF(COUNTIF($X$6:$X409,X409)=1,1,0)","v":0},0,{"$f":"IF(COUNTIF($Y$7:$Y409,Y409)=1,1,0)","v":0},"",":::::","","XXX","",{"$f":"IF(COUNTIF($W$6:$W409,$W409)=1,1,0)","v":0}]
[null,404,"",":::","",null,null,null,"",null,null,"","","",null,0,null,{"$f":"IF(COUNTIF($X$6:$X410,X410)=1,1,0)","v":0},0,{"$f":"IF(COUNTIF($Y$7:$Y410,Y410)=1,1,0)","v":0},"",":::::","","XXX","",{"$f":"IF(COUNTIF($W$6:$W410,$W410)=1,1,0)","v":0}]
[null,405,"",":::","",null,null,null,"",null,null,"","","",null,0,null,{"$f":"IF(COUNTIF($X$6:$X411,X411)=1,1,0)","v":0},0,{"$f":"IF(COUNTIF($Y$7:$Y411,Y411)=1,1,0)","v":0},"",":::::","","XXX","",{"$f":"IF(COUNTIF($W$6:$W411,$W411)=1,1,0)","v":0}]
[null,406,"",":::","",null,null,null,"",null,null,"","","",null,0,null,{"$f":"IF(COUNTIF($X$6:$X412,X412)=1,1,0)","v":0},0,{"$f":"IF(COUNTIF($Y$7:$Y412,Y412)=1,1,0)","v":0},"",":::::","","XXX","",{"$f":"IF(COUNTIF($W$6:$W412,$W412)=1,1,0)","v":0}]
[null,407,"",":::","",null,null,null,"",null,null,"","","",null,0,null,{"$f":"IF(COUNTIF($X$6:$X413,X413)=1,1,0)","v":0},0,{"$f":"IF(COUNTIF($Y$7:$Y413,Y413)=1,1,0)","v":0},"",":::::","","XXX","",{"$f":"IF(COUNTIF($W$6:$W413,$W413)=1,1,0)","v":0}]
[null,408,"",":::","",null,null,null,"",null,null,"","","",null,0,null,{"$f":"IF(COUNTIF($X$6:$X414,X414)=1,1,0)","v":0},0,{"$f":"IF(COUNTIF($Y$7:$Y414,Y414)=1,1,0)","v":0},"",":::::","","XXX","",{"$f":"IF(COUNTIF($W$6:$W414,$W414)=1,1,0)","v":0}]
[null,409,"",":::","",null,null,null,"",null,null,"","","",null,0,null,{"$f":"IF(COUNTIF($X$6:$X415,X415)=1,1,0)","v":0},0,{"$f":"IF(COUNTIF($Y$7:$Y415,Y415)=1,1,0)","v":0},"",":::::","","XXX","",{"$f":"IF(COUNTIF($W$6:$W415,$W415)=1,1,0)","v":0}]
[null,410,"",":::","",null,null,null,"",null,null,"","","",null,0,null,{"$f":"IF(COUNTIF($X$6:$X416,X416)=1,1,0)","v":0},0,{"$f":"IF(COUNTIF($Y$7:$Y416,Y416)=1,1,0)","v":0},"",":::::","","XXX","",{"$f":"IF(COUNTIF($W$6:$W416,$W416)=1,1,0)","v":0}]
[null,411,"",":::","",null,null,null,"",null,null,"","","",null,0,null,{"$f":"IF(COUNTIF($X$6:$X417,X417)=1,1,0)","v":0},0,{"$f":"IF(COUNTIF($Y$7:$Y417,Y417)=1,1,0)","v":0},"",":::::","","XXX","",{"$f":"IF(COUNTIF($W$6:$W417,$W417)=1,1,0)","v":0}]
[null,412,"",":::","",null,null,null,"",null,null,"","","",null,0,null,{"$f":"IF(COUNTIF($X$6:$X418,X418)=1,1,0)","v":0},0,{"$f":"IF(COUNTIF($Y$7:$Y418,Y418)=1,1,0)","v":0},"",":::::","","XXX","",{"$f":"IF(COUNTIF($W$6:$W418,$W418)=1,1,0)","v":0}]
[null,413,"",":::","",null,null,null,"",null,null,"","","",null,0,null,{"$f":"IF(COUNTIF($X$6:$X419,X419)=1,1,0)","v":0},0,{"$f":"IF(COUNTIF($Y$7:$Y419,Y419)=1,1,0)","v":0},"",":::::","","XXX","",{"$f":"IF(COUNTIF($W$6:$W419,$W419)=1,1,0)","v":0}]
[null,414,"",":::","",null,null,null,"",null,null,"","","",null,0,null,{"$f":"IF(COUNTIF($X$6:$X420,X420)=1,1,0)","v":0},0,{"$f":"IF(COUNTIF($Y$7:$Y420,Y420)=1,1,0)","v":0},"",":::::","","XXX","",{"$f":"IF(COUNTIF($W$6:$W420,$W420)=1,1,0)","v":0}]
[null,415,"",":::","",null,null,null,"",null,null,"","","",null,0,null,{"$f":"IF(COUNTIF($X$6:$X421,X421)=1,1,0)","v":0},0,{"$f":"IF(COUNTIF($Y$7:$Y421,Y421)=1,1,0)","v":0},"",":::::","","XXX","",{"$f":"IF(COUNTIF($W$6:$W421,$W421)=1,1,0)","v":0}]
[null,416,"",":::","",null,null,null,"",null,null,"","","",null,0,null,{"$f":"IF(COUNTIF($X$6:$X422,X422)=1,1,0)","v":0},0,{"$f":"IF(COUNTIF($Y$7:$Y422,Y422)=1,1,0)","v":0},"",":::::","","XXX","",{"$f":"IF(COUNTIF($W$6:$W422,$W422)=1,1,0)","v":0}]
[null,417,"",":::","",null,null,null,"",null,null,"","","",null,0,null,{"$f":"IF(COUNTIF($X$6:$X423,X423)=1,1,0)","v":0},0,{"$f":"IF(COUNTIF($Y$7:$Y423,Y423)=1,1,0)","v":0},"",":::::","","XXX","",{"$f":"IF(COUNTIF($W$6:$W423,$W423)=1,1,0)","v":0}]
[null,418,"",":::","",null,null,null,"",null,null,"","","",null,0,null,{"$f":"IF(COUNTIF($X$6:$X424,X424)=1,1,0)","v":0},0,{"$f":"IF(COUNTIF($Y$7:$Y424,Y424)=1,1,0)","v":0},"",":::::","","XXX","",{"$f":"IF(COUNTIF($W$6:$W424,$W424)=1,1,0)","v":0}]
[null,419,"",":::","",null,null,null,"",null,null,"","","",null,0,null,{"$f":"IF(COUNTIF($X$6:$X425,X425)=1,1,0)","v":0},0,{"$f":"IF(COUNTIF($Y$7:$Y425,Y425)=1,1,0)","v":0},"",":::::","","XXX","",{"$f":"IF(COUNTIF($W$6:$W425,$W425)=1,1,0)","v":0}]
[null,420,"",":::","",null,null,null,"",null,null,"","","",null,0,null,{"$f":"IF(COUNTIF($X$6:$X426,X426)=1,1,0)","v":0},0,{"$f":"IF(COUNTIF($Y$7:$Y426,Y426)=1,1,0)","v":0},"",":::::","","XXX","",{"$f":"IF(COUNTIF($W$6:$W426,$W426)=1,1,0)","v":0}]
[null,421,"",":::","",null,null,null,"",null,null,"","","",null,0,null,{"$f":"IF(COUNTIF($X$6:$X427,X427)=1,1,0)","v":0},0,{"$f":"IF(COUNTIF($Y$7:$Y427,Y427)=1,1,0)","v":0},"",":::::","","XXX","",{"$f":"IF(COUNTIF($W$6:$W427,$W427)=1,1,0)","v":0}]
[null,422,"",":::","",null,null,null,"",null,null,"","","",null,0,null,{"$f":"IF(COUNTIF($X$6:$X428,X428)=1,1,0)","v":0},0,{"$f":"IF(COUNTIF($Y$7:$Y428,Y428)=1,1,0)","v":0},"",":::::","","XXX","",{"$f":"IF(COUNTIF($W$6:$W428,$W428)=1,1,0)","v":0}]
[null,423,"",":::","",null,null,null,"",null,null,"","","",null,0,null,{"$f":"IF(COUNTIF($X$6:$X429,X429)=1,1,0)","v":0},0,{"$f":"IF(COUNTIF($Y$7:$Y429,Y429)=1,1,0)","v":0},"",":::::","","XXX","",{"$f":"IF(COUNTIF($W$6:$W429,$W429)=1,1,0)","v":0}]
[null,424,"",":::","",null,null,null,"",null,null,"","","",null,0,null,{"$f":"IF(COUNTIF($X$6:$X430,X430)=1,1,0)","v":0},0,{"$f":"IF(COUNTIF($Y$7:$Y430,Y430)=1,1,0)","v":0},"",":::::","","XXX","",{"$f":"IF(COUNTIF($W$6:$W430,$W430)=1,1,0)","v":0}]
[null,425,"",":::","",null,null,null,"",null,null,"","","",null,0,null,{"$f":"IF(COUNTIF($X$6:$X431,X431)=1,1,0)","v":0},0,{"$f":"IF(COUNTIF($Y$7:$Y431,Y431)=1,1,0)","v":0},"",":::::","","XXX","",{"$f":"IF(COUNTIF($W$6:$W431,$W431)=1,1,0)","v":0}]
[null,426,"",":::","",null,null,null,"",null,null,"","","",null,0,null,{"$f":"IF(COUNTIF($X$6:$X432,X432)=1,1,0)","v":0},0,{"$f":"IF(COUNTIF($Y$7:$Y432,Y432)=1,1,0)","v":0},"",":::::","","XXX","",{"$f":"IF(COUNTIF($W$6:$W432,$W432)=1,1,0)","v":0}]
[null,427,"",":::","",null,null,null,"",null,null,{"$f":"IF(E433=\"\",\"\",IF(T433=1,1,0))","v":""},{"$f":"IF(E433=\"\",\"\",R433+S433)","v":""},"",null,0,null,{"$f":"IF(COUNTIF($X$6:$X433,X433)=1,1,0)","v":0},{"$f":"IF(COUNTIF(SSTN,W433)=1,IF(Z433=0,0,1),0)","v":0},{"$f":"IF(COUNTIF($Y$7:$Y433,Y433)=1,1,0)","v":0},{"$f":"UPPER(SUBSTITUTE(I433,\" \",\"\",1))","v":""},{"$f":"CONCATENATE(LEFT(D433,2),\":\",RIGHT(D433,2))","v":":::::"},{"$f":"UPPER(E433)","v":""},{"$f":"IF(LEFT(W433,1)=\"D\",LEFT(W433,3),\"XXX\")","v":"XXX"},{"$f":"CONCATENATE(W433,(LEFT(J433,1)))","v":""},{"$f":"IF(COUNTIF($W$6:$W433,$W433)=1,1,0)","v":0}]
[null,428,"",":::","",null,null,null,"",null,null,"","","",null,0,null,{"$f":"IF(COUNTIF($X$6:$X434,X434)=1,1,0)","v":0},0,{"$f":"IF(COUNTIF($Y$7:$Y434,Y434)=1,1,0)","v":0},"",":::::","","XXX","",{"$f":"IF(COUNTIF($W$6:$W434,$W434)=1,1,0)","v":0}]
[null,429,"",":::","",null,null,null,"",null,null,"","","",null,0,null,{"$f":"IF(COUNTIF($X$6:$X435,X435)=1,1,0)","v":0},0,{"$f":"IF(COUNTIF($Y$7:$Y435,Y435)=1,1,0)","v":0},"",":::::","","XXX","",{"$f":"IF(COUNTIF($W$6:$W435,$W435)=1,1,0)","v":0}]
[null,430,"",":::","",null,null,null,"",null,null,"","","",null,0,null,{"$f":"IF(COUNTIF($X$6:$X436,X436)=1,1,0)","v":0},0,{"$f":"IF(COUNTIF($Y$7:$Y436,Y436)=1,1,0)","v":0},"",":::::","","XXX","",{"$f":"IF(COUNTIF($W$6:$W436,$W436)=1,1,0)","v":0}]
[null,431,"",":::","",null,null,null,"",null,null,"","","",null,0,null,{"$f":"IF(COUNTIF($X$6:$X437,X437)=1,1,0)","v":0},0,{"$f":"IF(COUNTIF($Y$7:$Y437,Y437)=1,1,0)","v":0},"",":::::","","XXX","",{"$f":"IF(COUNTIF($W$6:$W437,$W437)=1,1,0)","v":0}]
[null,432,"",":::","",null,null,null,"",null,null,"","","",null,0,null,{"$f":"IF(COUNTIF($X$6:$X438,X438)=1,1,0)","v":0},0,{"$f":"IF(COUNTIF($Y$7:$Y438,Y438)=1,1,0)","v":0},"",":::::","","XXX","",{"$f":"IF(COUNTIF($W$6:$W438,$W438)=1,1,0)","v":0}]
[null,433,"",":::","",null,null,null,"",null,null,"","","",null,0,null,{"$f":"IF(COUNTIF($X$6:$X439,X439)=1,1,0)","v":0},0,{"$f":"IF(COUNTIF($Y$7:$Y439,Y439)=1,1,0)","v":0},"",":::::","","XXX","",{"$f":"IF(COUNTIF($W$6:$W439,$W439)=1,1,0)","v":0}]
[null,434,"",":::","",null,null,null,"",null,null,"","","",null,0,null,{"$f":"IF(COUNTIF($X$6:$X440,X440)=1,1,0)","v":0},0,{"$f":"IF(COUNTIF($Y$7:$Y440,Y440)=1,1,0)","v":0},"",":::::","","XXX","",{"$f":"IF(COUNTIF($W$6:$W440,$W440)=1,1,0)","v":0}]
[null,435,"",":::","",null,null,null,"",null,null,"","","",null,0,null,{"$f":"IF(COUNTIF($X$6:$X441,X441)=1,1,0)","v":0},0,{"$f":"IF(COUNTIF($Y$7:$Y441,Y441)=1,1,0)","v":0},"",":::::","","XXX","",{"$f":"IF(COUNTIF($W$6:$W441,$W441)=1,1,0)","v":0}]
[null,436,"",":::","",null,null,null,"",null,null,"","","",null,0,null,{"$f":"IF(COUNTIF($X$6:$X442,X442)=1,1,0)","v":0},0,{"$f":"IF(COUNTIF($Y$7:$Y442,Y442)=1,1,0)","v":0},"",":::::","","XXX","",{"$f":"IF(COUNTIF($W$6:$W442,$W442)=1,1,0)","v":0}]
[null,437,"",":::","",null,null,null,"",null,null,"","","",null,0,null,{"$f":"IF(COUNTIF($X$6:$X443,X443)=1,1,0)","v":0},0,{"$f":"IF(COUNTIF($Y$7:$Y443,Y443)=1,1,0)","v":0},"",":::::","","XXX","",{"$f":"IF(COUNTIF($W$6:$W443,$W443)=1,1,0)","v":0}]
[null,438,"",":::","",null,null,null,"",null,null,"","","",null,0,null,{"$f":"IF(COUNTIF($X$6:$X444,X444)=1,1,0)","v":0},0,{"$f":"IF(COUNTIF($Y$7:$Y444,Y444)=1,1,0)","v":0},"",":::::","","XXX","",{"$f":"IF(COUNTIF($W$6:$W444,$W444)=1,1,0)","v":0}]
[null,439,"",":::","",null,null,null,"",null,null,"","","",null,0,null,{"$f":"IF(COUNTIF($X$6:$X445,X445)=1,1,0)","v":0},0,{"$f":"IF(COUNTIF($Y$7:$Y445,Y445)=1,1,0)","v":0},"",":::::","","XXX","",{"$f":"IF(COUNTIF($W$6:$W445,$W445)=1,1,0)","v":0}]
[null,440,"",":::","",null,null,null,"",null,null,"","","",null,0,null,{"$f":"IF(COUNTIF($X$6:$X446,X446)=1,1,0)","v":0},0,{"$f":"IF(COUNTIF($Y$7:$Y446,Y446)=1,1,0)","v":0},"",":::::","","XXX","",{"$f":"IF(COUNTIF($W$6:$W446,$W446)=1,1,0)","v":0}]
[null,441,"",":::","",null,null,null,"",null,null,"","","",null,0,null,{"$f":"IF(COUNTIF($X$6:$X447,X447)=1,1,0)","v":0},0,{"$f":"IF(COUNTIF($Y$7:$Y447,Y447)=1,1,0)","v":0},"",":::::","","XXX","",{"$f":"IF(COUNTIF($W$6:$W447,$W447)=1,1,0)","v":0}]
[null,442,"",":::","",null,null,null,"",null,null,"","","",null,0,null,{"$f":"IF(COUNTIF($X$6:$X448,X448)=1,1,0)","v":0},0,{"$f":"IF(COUNTIF($Y$7:$Y448,Y448)=1,1,0)","v":0},"",":::::","","XXX","",{"$f":"IF(COUNTIF($W$6:$W448,$W448)=1,1,0)","v":0}]
[null,443,"",":::","",null,null,null,"",null,null,"","","",null,0,null,{"$f":"IF(COUNTIF($X$6:$X449,X449)=1,1,0)","v":0},0,{"$f":"IF(COUNTIF($Y$7:$Y449,Y449)=1,1,0)","v":0},"",":::::","","XXX","",{"$f":"IF(COUNTIF($W$6:$W449,$W449)=1,1,0)","v":0}]
[null,444,"",":::","",null,null,null,"",null,null,"","","",null,0,null,{"$f":"IF(COUNTIF($X$6:$X450,X450)=1,1,0)","v":0},0,{"$f":"IF(COUNTIF($Y$7:$Y450,Y450)=1,1,0)","v":0},"",":::::","","XXX","",{"$f":"IF(COUNTIF($W$6:$W450,$W450)=1,1,0)","v":0}]
[null,445,"",":::","",null,null,null,"",null,null,"","","",null,0,null,{"$f":"IF(COUNTIF($X$6:$X451,X451)=1,1,0)","v":0},0,{"$f":"IF(COUNTIF($Y$7:$Y451,Y451)=1,1,0)","v":0},"",":::::","","XXX","",{"$f":"IF(COUNTIF($W$6:$W451,$W451)=1,1,0)","v":0}]
[null,446,"",":::","",null,null,null,"",null,null,"","","",null,0,null,{"$f":"IF(COUNTIF($X$6:$X452,X452)=1,1,0)","v":0},0,{"$f":"IF(COUNTIF($Y$7:$Y452,Y452)=1,1,0)","v":0},"",":::::","","XXX","",{"$f":"IF(COUNTIF($W$6:$W452,$W452)=1,1,0)","v":0}]
[null,447,"",":::","",null,null,null,"",null,null,"","","",null,0,null,{"$f":"IF(COUNTIF($X$6:$X453,X453)=1,1,0)","v":0},0,{"$f":"IF(COUNTIF($Y$7:$Y453,Y453)=1,1,0)","v":0},"",":::::","","XXX","",{"$f":"IF(COUNTIF($W$6:$W453,$W453)=1,1,0)","v":0}]
[null,448,"",":::","",null,null,null,"",null,null,"","","",null,0,null,{"$f":"IF(COUNTIF($X$6:$X454,X454)=1,1,0)","v":0},0,{"$f":"IF(COUNTIF($Y$7:$Y454,Y454)=1,1,0)","v":0},"",":::::","","XXX","",{"$f":"IF(COUNTIF($W$6:$W454,$W454)=1,1,0)","v":0}]
[null,449,{"$f":"IF(F455>0,date1,\"\")","v":""},":::","",null,null,null,"",null,null,"","","",null,0,null,{"$f":"IF(COUNTIF($X$6:$X455,X455)=1,1,0)","v":0},0,{"$f":"IF(COUNTIF($Y$7:$Y455,Y455)=1,1,0)","v":0},"",":::::","","XXX","",{"$f":"IF(COUNTIF($W$6:$W455,$W455)=1,1,0)","v":0}]
[null,450,"",":::","",null,null,null,"",null,null,"","","",null,{"$f":"IF(F456>0,1,0)","v":0},null,{"$f":"IF(COUNTIF($X$6:$X456,X456)=1,1,0)","v":0},0,{"$f":"IF(COUNTIF($Y$7:$Y456,Y456)=1,1,0)","v":0},"",":::::","","XXX","",{"$f":"IF(COUNTIF($W$6:$W456,$W456)=1,1,0)","v":0}]
[null,451,"",":::","",null,null,null,"",null,null,"","","",null,0,null,{"$f":"IF(COUNTIF($X$6:$X457,X457)=1,1,0)","v":0},0,{"$f":"IF(COUNTIF($Y$7:$Y457,Y457)=1,1,0)","v":0},"",":::::","","XXX","",{"$f":"IF(COUNTIF($W$6:$W457,$W457)=1,1,0)","v":0}]
[null,452,"",":::","",null,null,null,"",null,null,"","","",null,0,null,{"$f":"IF(COUNTIF($X$6:$X458,X458)=1,1,0)","v":0},0,{"$f":"IF(COUNTIF($Y$7:$Y458,Y458)=1,1,0)","v":0},"",":::::","","XXX","",{"$f":"IF(COUNTIF($W$6:$W458,$W458)=1,1,0)","v":0}]
[null,453,"",":::","",null,null,null,"",null,null,"","","",null,0,null,{"$f":"IF(COUNTIF($X$6:$X459,X459)=1,1,0)","v":0},0,{"$f":"IF(COUNTIF($Y$7:$Y459,Y459)=1,1,0)","v":0},"",":::::","","XXX","",{"$f":"IF(COUNTIF($W$6:$W459,$W459)=1,1,0)","v":0}]
[null,454,"",":::","",null,null,null,"",null,null,"","","",null,0,null,{"$f":"IF(COUNTIF($X$6:$X460,X460)=1,1,0)","v":0},0,{"$f":"IF(COUNTIF($Y$7:$Y460,Y460)=1,1,0)","v":0},"",":::::","","XXX","",{"$f":"IF(COUNTIF($W$6:$W460,$W460)=1,1,0)","v":0}]
[null,455,"",":::","",null,null,null,"",null,null,"","","",null,0,null,{"$f":"IF(COUNTIF($X$6:$X461,X461)=1,1,0)","v":0},0,{"$f":"IF(COUNTIF($Y$7:$Y461,Y461)=1,1,0)","v":0},"",":::::","","XXX","",{"$f":"IF(COUNTIF($W$6:$W461,$W461)=1,1,0)","v":0}]
[null,456,"",":::","",null,null,null,"",null,null,"","","",null,0,null,{"$f":"IF(COUNTIF($X$6:$X462,X462)=1,1,0)","v":0},0,{"$f":"IF(COUNTIF($Y$7:$Y462,Y462)=1,1,0)","v":0},"",":::::","","XXX","",{"$f":"IF(COUNTIF($W$6:$W462,$W462)=1,1,0)","v":0}]
[null,457,"",":::","",null,null,null,"",null,null,"","","",null,0,null,{"$f":"IF(COUNTIF($X$6:$X463,X463)=1,1,0)","v":0},0,{"$f":"IF(COUNTIF($Y$7:$Y463,Y463)=1,1,0)","v":0},"",":::::","","XXX","",{"$f":"IF(COUNTIF($W$6:$W463,$W463)=1,1,0)","v":0}]
[null,458,"",":::","",null,null,null,"",null,null,"","",{"$f":"IF(E464=\"\",\"\",IF(T464=0,\"doppeltes Call\",\"\"))","v":""},null,0,null,{"$f":"IF(COUNTIF($X$6:$X464,X464)=1,1,0)","v":0},0,{"$f":"IF(COUNTIF($Y$7:$Y464,Y464)=1,1,0)","v":0},"",":::::","","XXX","",{"$f":"IF(COUNTIF($W$6:$W464,$W464)=1,1,0)","v":0}]
[null,459,"",":::","",null,null,null,"",null,null,"","","",null,0,null,{"$f":"IF(COUNTIF($X$6:$X465,X465)=1,1,0)","v":0},0,{"$f":"IF(COUNTIF($Y$7:$Y465,Y465)=1,1,0)","v":0},"",":::::","","XXX","",{"$f":"IF(COUNTIF($W$6:$W465,$W465)=1,1,0)","v":0}]
[null,460,"",":::","",null,null,null,"",null,null,"","","",null,0,null,{"$f":"IF(COUNTIF($X$6:$X466,X466)=1,1,0)","v":0},0,{"$f":"IF(COUNTIF($Y$7:$Y466,Y466)=1,1,0)","v":0},"",":::::","","XXX","",{"$f":"IF(COUNTIF($W$6:$W466,$W466)=1,1,0)","v":0}]
[null,461,"",":::","",null,null,null,"",null,null,"","","",null,0,null,{"$f":"IF(COUNTIF($X$6:$X467,X467)=1,1,0)","v":0},0,{"$f":"IF(COUNTIF($Y$7:$Y467,Y467)=1,1,0)","v":0},"",":::::","","XXX","",{"$f":"IF(COUNTIF($W$6:$W467,$W467)=1,1,0)","v":0}]
[null,462,"",":::","",null,null,null,"",null,null,"","","",null,0,null,{"$f":"IF(COUNTIF($X$6:$X468,X468)=1,1,0)","v":0},0,{"$f":"IF(COUNTIF($Y$7:$Y468,Y468)=1,1,0)","v":0},"",":::::","","XXX","",{"$f":"IF(COUNTIF($W$6:$W468,$W468)=1,1,0)","v":0}]
[null,463,"",":::","",null,null,null,"",null,null,"","","",null,0,null,{"$f":"IF(COUNTIF($X$6:$X469,X469)=1,1,0)","v":0},0,{"$f":"IF(COUNTIF($Y$7:$Y469,Y469)=1,1,0)","v":0},"",":::::","","XXX","",{"$f":"IF(COUNTIF($W$6:$W469,$W469)=1,1,0)","v":0}]
[null,464,"",":::","",null,null,null,"",null,null,"","","",null,0,null,{"$f":"IF(COUNTIF($X$6:$X470,X470)=1,1,0)","v":0},0,{"$f":"IF(COUNTIF($Y$7:$Y470,Y470)=1,1,0)","v":0},"",":::::","","XXX","",{"$f":"IF(COUNTIF($W$6:$W470,$W470)=1,1,0)","v":0}]
[null,465,"",":::","",null,null,null,"",null,null,"","","",null,0,null,{"$f":"IF(COUNTIF($X$6:$X471,X471)=1,1,0)","v":0},0,{"$f":"IF(COUNTIF($Y$7:$Y471,Y471)=1,1,0)","v":0},"",":::::","","XXX","",{"$f":"IF(COUNTIF($W$6:$W471,$W471)=1,1,0)","v":0}]
[null,466,"",":::","",null,null,null,"",null,null,"","","",null,0,null,{"$f":"IF(COUNTIF($X$6:$X472,X472)=1,1,0)","v":0},0,{"$f":"IF(COUNTIF($Y$7:$Y472,Y472)=1,1,0)","v":0},"",":::::","","XXX","",{"$f":"IF(COUNTIF($W$6:$W472,$W472)=1,1,0)","v":0}]
[null,467,"",":::","",null,null,null,"",null,null,"","","",null,0,null,{"$f":"IF(COUNTIF($X$6:$X473,X473)=1,1,0)","v":0},0,{"$f":"IF(COUNTIF($Y$7:$Y473,Y473)=1,1,0)","v":0},"",":::::","","XXX","",{"$f":"IF(COUNTIF($W$6:$W473,$W473)=1,1,0)","v":0}]
[null,468,"",":::","",null,null,null,"",null,null,"","","",null,0,null,{"$f":"IF(COUNTIF($X$6:$X474,X474)=1,1,0)","v":0},0,{"$f":"IF(COUNTIF($Y$7:$Y474,Y474)=1,1,0)","v":0},"",":::::","","XXX","",{"$f":"IF(COUNTIF($W$6:$W474,$W474)=1,1,0)","v":0}]
[null,469,"",":::","",null,null,null,"",null,null,"","","",null,0,null,{"$f":"IF(COUNTIF($X$6:$X475,X475)=1,1,0)","v":0},0,{"$f":"IF(COUNTIF($Y$7:$Y475,Y475)=1,1,0)","v":0},"",":::::","","XXX","",{"$f":"IF(COUNTIF($W$6:$W475,$W475)=1,1,0)","v":0}]
[null,470,"",":::","",null,null,null,"",null,null,"","","",null,0,null,{"$f":"IF(COUNTIF($X$6:$X476,X476)=1,1,0)","v":0},0,{"$f":"IF(COUNTIF($Y$7:$Y476,Y476)=1,1,0)","v":0},"",":::::","","XXX","",{"$f":"IF(COUNTIF($W$6:$W476,$W476)=1,1,0)","v":0}]
[null,471,"",":::","",null,null,null,"",null,null,"","","",null,0,null,{"$f":"IF(COUNTIF($X$6:$X477,X477)=1,1,0)","v":0},0,{"$f":"IF(COUNTIF($Y$7:$Y477,Y477)=1,1,0)","v":0},"",":::::","","XXX","",{"$f":"IF(COUNTIF($W$6:$W477,$W477)=1,1,0)","v":0}]
[null,472,"",":::","",null,null,null,"",null,null,"","","",null,0,null,{"$f":"IF(COUNTIF($X$6:$X478,X478)=1,1,0)","v":0},0,{"$f":"IF(COUNTIF($Y$7:$Y478,Y478)=1,1,0)","v":0},"",":::::","","XXX","",{"$f":"IF(COUNTIF($W$6:$W478,$W478)=1,1,0)","v":0}]
[null,473,"",":::","",null,null,null,"",null,null,"","","",null,0,null,{"$f":"IF(COUNTIF($X$6:$X479,X479)=1,1,0)","v":0},0,{"$f":"IF(COUNTIF($Y$7:$Y479,Y479)=1,1,0)","v":0},"",":::::","","XXX","",{"$f":"IF(COUNTIF($W$6:$W479,$W479)=1,1,0)","v":0}]
[null,474,"",":::","",null,null,null,"",null,null,"","","",null,0,null,{"$f":"IF(COUNTIF($X$6:$X480,X480)=1,1,0)","v":0},0,{"$f":"IF(COUNTIF($Y$7:$Y480,Y480)=1,1,0)","v":0},"",":::::","","XXX","",{"$f":"IF(COUNTIF($W$6:$W480,$W480)=1,1,0)","v":0}]
[null,475,"",":::","",null,null,null,"",null,null,"","","",null,0,null,{"$f":"IF(COUNTIF($X$6:$X481,X481)=1,1,0)","v":0},0,{"$f":"IF(COUNTIF($Y$7:$Y481,Y481)=1,1,0)","v":0},"",":::::","","XXX","",{"$f":"IF(COUNTIF($W$6:$W481,$W481)=1,1,0)","v":0}]
[null,476,"",":::","",null,null,null,"",null,null,"","","",null,0,null,{"$f":"IF(COUNTIF($X$6:$X482,X482)=1,1,0)","v":0},0,{"$f":"IF(COUNTIF($Y$7:$Y482,Y482)=1,1,0)","v":0},"",":::::","","XXX","",{"$f":"IF(COUNTIF($W$6:$W482,$W482)=1,1,0)","v":0}]
[null,477,"",":::","",null,null,null,"",null,null,"","","",null,0,null,{"$f":"IF(COUNTIF($X$6:$X483,X483)=1,1,0)","v":0},0,{"$f":"IF(COUNTIF($Y$7:$Y483,Y483)=1,1,0)","v":0},"",":::::","","XXX","",{"$f":"IF(COUNTIF($W$6:$W483,$W483)=1,1,0)","v":0}]
[null,478,"",":::","",null,null,null,"",null,null,"","","",null,0,null,{"$f":"IF(COUNTIF($X$6:$X484,X484)=1,1,0)","v":0},0,{"$f":"IF(COUNTIF($Y$7:$Y484,Y484)=1,1,0)","v":0},"",":::::","","XXX","",{"$f":"IF(COUNTIF($W$6:$W484,$W484)=1,1,0)","v":0}]
[null,479,"",":::","",null,null,null,"",null,null,"","","",null,0,null,{"$f":"IF(COUNTIF($X$6:$X485,X485)=1,1,0)","v":0},0,{"$f":"IF(COUNTIF($Y$7:$Y485,Y485)=1,1,0)","v":0},"",":::::","","XXX","",{"$f":"IF(COUNTIF($W$6:$W485,$W485)=1,1,0)","v":0}]
[null,480,"",":::","",null,null,null,"",null,null,"","","",null,0,null,{"$f":"IF(COUNTIF($X$6:$X486,X486)=1,1,0)","v":0},0,{"$f":"IF(COUNTIF($Y$7:$Y486,Y486)=1,1,0)","v":0},"",":::::","","XXX","",{"$f":"IF(COUNTIF($W$6:$W486,$W486)=1,1,0)","v":0}]
[null,481,"",":::","",null,null,null,"",null,null,"","","",null,0,null,{"$f":"IF(COUNTIF($X$6:$X487,X487)=1,1,0)","v":0},0,{"$f":"IF(COUNTIF($Y$7:$Y487,Y487)=1,1,0)","v":0},"",":::::","","XXX","",{"$f":"IF(COUNTIF($W$6:$W487,$W487)=1,1,0)","v":0}]
[null,482,"",":::","",null,null,null,"",null,null,"","","",null,0,null,{"$f":"IF(COUNTIF($X$6:$X488,X488)=1,1,0)","v":0},0,{"$f":"IF(COUNTIF($Y$7:$Y488,Y488)=1,1,0)","v":0},"",":::::","","XXX","",{"$f":"IF(COUNTIF($W$6:$W488,$W488)=1,1,0)","v":0}]
[null,483,"",":::","",null,null,null,"",null,null,"","","",null,0,null,{"$f":"IF(COUNTIF($X$6:$X489,X489)=1,1,0)","v":0},0,{"$f":"IF(COUNTIF($Y$7:$Y489,Y489)=1,1,0)","v":0},"",":::::","","XXX","",{"$f":"IF(COUNTIF($W$6:$W489,$W489)=1,1,0)","v":0}]
[null,484,"",":::","",null,null,null,"",null,null,"","","",null,0,null,{"$f":"IF(COUNTIF($X$6:$X490,X490)=1,1,0)","v":0},0,{"$f":"IF(COUNTIF($Y$7:$Y490,Y490)=1,1,0)","v":0},"",":::::","","XXX","",{"$f":"IF(COUNTIF($W$6:$W490,$W490)=1,1,0)","v":0}]
[null,485,"",":::","",null,null,null,"",null,null,"","","",null,0,null,{"$f":"IF(COUNTIF($X$6:$X491,X491)=1,1,0)","v":0},0,{"$f":"IF(COUNTIF($Y$7:$Y491,Y491)=1,1,0)","v":0},"",":::::","","XXX","",{"$f":"IF(COUNTIF($W$6:$W491,$W491)=1,1,0)","v":0}]
[null,486,"",":::","",null,null,null,"",null,null,"","","",null,0,null,{"$f":"IF(COUNTIF($X$6:$X492,X492)=1,1,0)","v":0},0,{"$f":"IF(COUNTIF($Y$7:$Y492,Y492)=1,1,0)","v":0},"",":::::","","XXX","",{"$f":"IF(COUNTIF($W$6:$W492,$W492)=1,1,0)","v":0}]
[null,487,"",":::","",null,null,null,"",null,null,"","","",null,0,null,{"$f":"IF(COUNTIF($X$6:$X493,X493)=1,1,0)","v":0},0,{"$f":"IF(COUNTIF($Y$7:$Y493,Y493)=1,1,0)","v":0},"",":::::","","XXX","",{"$f":"IF(COUNTIF($W$6:$W493,$W493)=1,1,0)","v":0}]
[null,488,"",":::","",null,null,null,"",null,null,"","","",null,0,null,{"$f":"IF(COUNTIF($X$6:$X494,X494)=1,1,0)","v":0},0,{"$f":"IF(COUNTIF($Y$7:$Y494,Y494)=1,1,0)","v":0},"",":::::","","XXX","",{"$f":"IF(COUNTIF($W$6:$W494,$W494)=1,1,0)","v":0}]
[null,489,"",":::","",null,null,null,"",null,null,"","","",null,0,null,{"$f":"IF(COUNTIF($X$6:$X495,X495)=1,1,0)","v":0},0,{"$f":"IF(COUNTIF($Y$7:$Y495,Y495)=1,1,0)","v":0},"",":::::","","XXX","",{"$f":"IF(COUNTIF($W$6:$W495,$W495)=1,1,0)","v":0}]
[null,490,"",":::","",null,null,null,"",null,null,"","","",null,0,null,{"$f":"IF(COUNTIF($X$6:$X496,X496)=1,1,0)","v":0},0,{"$f":"IF(COUNTIF($Y$7:$Y496,Y496)=1,1,0)","v":0},"",":::::","","XXX","",{"$f":"IF(COUNTIF($W$6:$W496,$W496)=1,1,0)","v":0}]
[null,491,"",":::","",null,null,null,"",null,null,{"$f":"IF(E497=\"\",\"\",IF(T497=1,1,0))","v":""},{"$f":"IF(E497=\"\",\"\",R497+S497)","v":""},"",null,0,null,{"$f":"IF(COUNTIF($X$6:$X497,X497)=1,1,0)","v":0},{"$f":"IF(COUNTIF(SSTN,W497)=1,IF(Z497=0,0,1),0)","v":0},{"$f":"IF(COUNTIF($Y$7:$Y497,Y497)=1,1,0)","v":0},{"$f":"UPPER(SUBSTITUTE(I497,\" \",\"\",1))","v":""},{"$f":"CONCATENATE(LEFT(D497,2),\":\",RIGHT(D497,2))","v":":::::"},{"$f":"UPPER(E497)","v":""},{"$f":"IF(LEFT(W497,1)=\"D\",LEFT(W497,3),\"XXX\")","v":"XXX"},{"$f":"CONCATENATE(W497,(LEFT(J497,1)))","v":""},{"$f":"IF(COUNTIF($W$6:$W497,$W497)=1,1,0)","v":0}]
[null,492,"",":::","",null,null,null,"",null,null,"","","",null,0,null,{"$f":"IF(COUNTIF($X$6:$X498,X498)=1,1,0)","v":0},0,{"$f":"IF(COUNTIF($Y$7:$Y498,Y498)=1,1,0)","v":0},"",":::::","","XXX","",{"$f":"IF(COUNTIF($W$6:$W498,$W498)=1,1,0)","v":0}]
[null,493,"",":::","",null,null,null,"",null,null,"","","",null,0,null,{"$f":"IF(COUNTIF($X$6:$X499,X499)=1,1,0)","v":0},0,{"$f":"IF(COUNTIF($Y$7:$Y499,Y499)=1,1,0)","v":0},"",":::::","","XXX","",{"$f":"IF(COUNTIF($W$6:$W499,$W499)=1,1,0)","v":0}]
[null,494,"",":::","",null,null,null,"",null,null,"","","",null,0,null,{"$f":"IF(COUNTIF($X$6:$X500,X500)=1,1,0)","v":0},0,{"$f":"IF(COUNTIF($Y$7:$Y500,Y500)=1,1,0)","v":0},"",":::::","","XXX","",{"$f":"IF(COUNTIF($W$6:$W500,$W500)=1,1,0)","v":0}]
[null,495,"",":::","",null,null,null,"",null,null,"","","",null,0,null,{"$f":"IF(COUNTIF($X$6:$X501,X501)=1,1,0)","v":0},0,{"$f":"IF(COUNTIF($Y$7:$Y501,Y501)=1,1,0)","v":0},"",":::::","","XXX","",{"$f":"IF(COUNTIF($W$6:$W501,$W501)=1,1,0)","v":0}]
[null,496,"",":::","",null,null,null,"",null,null,"","","",null,0,null,{"$f":"IF(COUNTIF($X$6:$X502,X502)=1,1,0)","v":0},0,{"$f":"IF(COUNTIF($Y$7:$Y502,Y502)=1,1,0)","v":0},"",":::::","","XXX","",{"$f":"IF(COUNTIF($W$6:$W502,$W502)=1,1,0)","v":0}]
[null,497,"",":::","",null,null,null,"",null,null,"","","",null,0,null,{"$f":"IF(COUNTIF($X$6:$X503,X503)=1,1,0)","v":0},0,{"$f":"IF(COUNTIF($Y$7:$Y503,Y503)=1,1,0)","v":0},"",":::::","","XXX","",{"$f":"IF(COUNTIF($W$6:$W503,$W503)=1,1,0)","v":0}]
[null,498,"",":::","",null,null,null,"",null,null,"","","",null,0,null,{"$f":"IF(COUNTIF($X$6:$X504,X504)=1,1,0)","v":0},0,{"$f":"IF(COUNTIF($Y$7:$Y504,Y504)=1,1,0)","v":0},"",":::::","","XXX","",{"$f":"IF(COUNTIF($W$6:$W504,$W504)=1,1,0)","v":0}]
[null,499,"",":::","",null,null,null,"",null,null,"","","",null,0,null,{"$f":"IF(COUNTIF($X$6:$X505,X505)=1,1,0)","v":0},0,{"$f":"IF(COUNTIF($Y$7:$Y505,Y505)=1,1,0)","v":0},"",":::::","","XXX","",{"$f":"IF(COUNTIF($W$6:$W505,$W505)=1,1,0)","v":0}]
[null,500,"",":::","",null,null,null,"",null,null,"","","",null,0,null,{"$f":"IF(COUNTIF($X$6:$X506,X506)=1,1,0)","v":0},0,{"$f":"IF(COUNTIF($Y$7:$Y506,Y506)=1,1,0)","v":0},"",":::::","","XXX","",{"$f":"IF(COUNTIF($W$6:$W506,$W506)=1,1,0)","v":0}]

{"sheet":"Tabelle1","index":3,"n_rows":0,"n_cols":0,"rows_kept":0,"cut":false,"hidden":true,"merged":[]}

{"sheet":"Tabelle2","index":4,"n_rows":0,"n_cols":0,"rows_kept":0,"cut":false,"hidden":true,"merged":[]}